{"text_format":"1","workbook":"xlsx","n_sheets":7,"sheets":["Liga","48er komplett","nur Datendruck","48er - Muster für Datendruck","Anlage 7","Gaststätte","Liste"],"not_rendered":{"charts":0,"images":0,"macros":1,"external_links":0,"defined_names":4,"comments":1,"pivot_tables":0},"unopened":[],"bounds":{"document_bytes":16777216,"sheet_cells":100000,"rows_first":2000,"rows_last":500,"rows_between":2000,"halvings":0,"cell_chars":16384,"cell_head_chars":4096},"cells_cut":0,"cells_raw":0,"read":"whole","date_system":"1900"}

{"sheet":"Liga","index":0,"n_rows":113,"n_cols":48,"rows_kept":113,"cut":false,"hidden":false,"merged":[[1,5,1,8]]}
["Tisch- und Platzordnung 1. - 5. Spieltag",null,null,null,null,null,null,null,null,null,null,"16er Staffel",null,null,null,"für Druck der Spiellisten",null,null,null,null,null,15]
["Auswahl über Dropdown-Feld =>",null,null,null,null,"Regionalliga Staffel 6",null,null,null,null,"Spieltag :",2,null,"Datum :",{"$f":"VLOOKUP($L$2,$A$8:$B$12,2,FALSE)","v":"2025-04-05"},null,null,null,"Vierergruppe :","alle",null,"nur Datendruck",null,"Hilfstabelle für Ligatermine     (Akt. Jahr =>)",null,null,null,null,null,2025,{"$f":"HLOOKUP(AD2,Y6:AC7,2,FALSE)","v":2}]
[null,null,null,null,null,{"$f":"COLUMN()","v":6},{"$f":"COLUMN()","v":7},{"$f":"COLUMN()","v":8},{"$f":"COLUMN()","v":9},{"$f":"COLUMN()","v":10},{"$f":"COLUMN()","v":11},{"$f":"COLUMN()","v":12},{"$f":"COLUMN()","v":13},{"$f":"COLUMN()","v":14},{"$f":"COLUMN()","v":15},{"$f":"COLUMN()","v":16},{"$f":"COLUMN()","v":17},{"$f":"COLUMN()","v":18},{"$f":"COLUMN()","v":19},{"$f":"COLUMN()","v":20},{"$f":"COLUMN()","v":21}]
[null,{"$f":"F4+J4+N4+R4","v":0},{"$f":"G4+K4+O4+S4","v":0},{"$f":"H4+L4+P4+T4","v":0},{"$f":"I4+M4+Q4+U4","v":0},{"$f":"IF($T$2=$F$7,F3,0)","v":0},{"$f":"IF($T$2=$F$7,G3,0)","v":0},{"$f":"IF($T$2=$F$7,H3,0)","v":0},{"$f":"IF($T$2=$F$7,I3,0)","v":0},{"$f":"IF($T$2=$J$7,J3,0)","v":0},{"$f":"IF($T$2=$J$7,K3,0)","v":0},{"$f":"IF($T$2=$J$7,L3,0)","v":0},{"$f":"IF($T$2=$J$7,M3,0)","v":0},{"$f":"IF($T$2=$N$7,N3,0)","v":0},{"$f":"IF($T$2=$N$7,O3,0)","v":0},{"$f":"IF($T$2=$N$7,P3,0)","v":0},{"$f":"IF($T$2=$N$7,Q3,0)","v":0},{"$f":"IF($T$2=$R$7,R3,0)","v":0},{"$f":"IF($T$2=$R$7,S3,0)","v":0},{"$f":"IF($T$2=$R$7,T3,0)","v":0},{"$f":"IF($T$2=$R$7,U3,0)","v":0}]
[null,null,{"$f":"MAX(D15:D30)","v":16},null,"Tisch :",{"$f":"COLUMN()-5","v":1},{"$f":"COLUMN()-5","v":2},{"$f":"COLUMN()-5","v":3},{"$f":"COLUMN()-5","v":4},{"$f":"IF($T$2=\"alle\",COLUMN()-5,0)","v":5},{"$f":"IF($T$2=\"alle\",COLUMN()-5,0)","v":6},7,8,9,10,11,12,13,14,15,16]
["Ergebnis der Auswahl :",null,null,null,null,{"$f":"IF($T$2=\"alle\",VLOOKUP($L$2,$A$8:$U$12,COLUMN(),FALSE),VLOOKUP($L$2,$A$8:$U$12,B4,FALSE))","v":"E"},{"$f":"IF($T$2=\"alle\",VLOOKUP($L$2,$A$8:$U$12,COLUMN(),FALSE),VLOOKUP($L$2,$A$8:$U$12,C4,FALSE))","v":"B"},{"$f":"IF($T$2=\"alle\",VLOOKUP($L$2,$A$8:$U$12,COLUMN(),FALSE),VLOOKUP($L$2,$A$8:$U$12,D4,FALSE))","v":"N"},{"$f":"IF($T$2=\"alle\",VLOOKUP($L$2,$A$8:$U$12,COLUMN(),FALSE),VLOOKUP($L$2,$A$8:$U$12,E4,FALSE))","v":"S"},{"$f":"IF($T$2=\"alle\",VLOOKUP($L$2,$A$8:$U$12,COLUMN(),FALSE),\"\")","v":"F"},{"$f":"IF($T$2=\"alle\",VLOOKUP($L$2,$A$8:$U$12,COLUMN(),FALSE),\"\")","v":"A"},"M","T","H","D","L","P","J","C","K","R",{"$f":"IF(V2=\"nur Datendruck\",\"48er - Muster\",\"Listen werden\")","v":"48er - Muster"},null,"ST",{"$f":"YEAR(Y8)","v":2025},2026,2027,2028,2029,2030,null,null,"\"HT\" für Spielbericht_16er-Staffel.xlsx"]
["Spieltag","Datum"," Serien",null,null,1,null,null,null,2,null,null,null,3,null,null,null,4,null,null,null,{"$f":"IF(V2=\"nur Datendruck\",\"verwenden !\",\"komplett gedruckt\")","v":"verwenden !"},null,{"$f":"COLUMN()","v":24},{"$f":"COLUMN()-$X7+1","v":2},3,4,5,6,7]
[1,{"$f":"VLOOKUP(A8,$X$8:$AC$12,$AE$2,FALSE)","v":"2025-03-22"},1,2,{"$f":"IF($V$1=10,0,3)","v":3},"A","P","E","K","B","R","F","L","C","S","H","M","D","T","J","N",null,null,{"$f":"A8","v":1},"2025-03-22","2026-03-21","2027-04-03","2028-03-25","2029-04-07","2030-03-30",null,null,{"$f":"F8","v":"A"},{"$f":"H8","v":"E"},"K",{"$f":"G8","v":"P"},{"$f":"J8","v":"B"},{"$f":"L8","v":"F"},"L",{"$f":"K8","v":"R"},{"$f":"N8","v":"C"},{"$f":"P8","v":"H"},"M",{"$f":"O8","v":"S"},{"$f":"R8","v":"D"},{"$f":"T8","v":"J"},"N",{"$f":"S8","v":"T"}]
[2,{"$f":"VLOOKUP(A9,$X$8:$AC$12,$AE$2,FALSE)","v":"2025-04-05"},{"$f":"IF($V$1=10,3,4)","v":4},{"$f":"IF($V$1=10,4,5)","v":5},{"$f":"IF($V$1=10,0,6)","v":6},"E","B","N","S","F","A","M","T","H","D","L","P","J","C","K","R",null,null,{"$f":"A9","v":2},"2025-04-05","2026-04-11","2027-04-24","2028-04-29","2029-04-28","2030-04-27",null,null,{"$f":"F9","v":"E"},"N","S",{"$f":"G9","v":"B"},{"$f":"J9","v":"F"},"M","T",{"$f":"K9","v":"A"},{"$f":"N9","v":"H"},"L","P",{"$f":"O9","v":"D"},{"$f":"R9","v":"J"},"K","R",{"$f":"S9","v":"C"}]
[3,{"$f":"VLOOKUP(A10,$X$8:$AC$12,$AE$2,FALSE)","v":"2025-05-03"},{"$f":"IF($V$1=10,5,7)","v":7},{"$f":"IF($V$1=10,6,8)","v":8},{"$f":"IF($V$1=10,0,9)","v":9},"K","F","S","D","L","E","T","C","M","J","P","B","N","H","R","A",null,null,{"$f":"A10","v":3},"2025-05-03","2026-05-09","2027-05-22","2028-05-20","2029-05-26","2030-05-18",null,null,{"$f":"F10","v":"K"},"S","D",{"$f":"G10","v":"F"},{"$f":"J10","v":"L"},"T","C",{"$f":"K10","v":"E"},{"$f":"N10","v":"M"},"P","B",{"$f":"O10","v":"J"},{"$f":"R10","v":"N"},"R","A",{"$f":"S10","v":"H"}]
[4,{"$f":"VLOOKUP(A11,$X$8:$AC$12,$AE$2,FALSE)","v":"2025-05-24"},{"$f":"IF($V$1=10,7,10)","v":10},{"$f":"IF($V$1=10,8,11)","v":11},{"$f":"IF($V$1=10,0,12)","v":12},"P","N","C","F","R","M","D","E","S","L","A","J","T","K","B","H",null,null,{"$f":"A11","v":4},"2025-05-24","2026-06-06","2027-06-26","2028-06-24","2029-06-23","2030-06-29",null,null,{"$f":"F11","v":"P"},"C","F",{"$f":"G11","v":"N"},{"$f":"J11","v":"R"},"D","E",{"$f":"K11","v":"M"},{"$f":"N11","v":"S"},"A","J",{"$f":"O11","v":"L"},{"$f":"R11","v":"T"},"B","H",{"$f":"S11","v":"K"}]
[5,{"$f":"VLOOKUP(A12,$X$8:$AC$12,$AE$2,FALSE)","v":"2025-09-13"},{"$f":"IF($V$1=10,9,13)","v":13},{"$f":"IF($V$1=10,10,14)","v":14},{"$f":"IF($V$1=10,0,15)","v":15},"A","D","B","C","E","J","F","H","K","N","L","M","P","T","R","S",null,null,{"$f":"A12","v":5},"2025-09-13","2026-09-12","2027-09-11","2028-09-09","2029-09-08","2030-09-07",null,null,{"$f":"F12","v":"A"},"B","C",{"$f":"G12","v":"D"},{"$f":"J12","v":"E"},"F","H",{"$f":"K12","v":"J"},{"$f":"N12","v":"K"},"L","M",{"$f":"O12","v":"N"},{"$f":"R12","v":"P"},"R","S",{"$f":"S12","v":"T"}]
[]
[null,null,null,"Tisch",null,{"$f":"VLOOKUP($L$2,$A$8:$E$12,3,FALSE)","v":4},null,null,null,{"$f":"VLOOKUP($L$2,$A$8:$E$12,4,FALSE)","v":5},null,null,null,{"$f":"VLOOKUP($L$2,$A$8:$E$12,5,FALSE)","v":6},null,null,null,null,null,null,null,"Datenbereich für F2 :"]
[null,null,1,{"$f":"E15","v":1},1,{"$f":"F$6&$E15","v":"E1"},{"$f":"G$6&$E18","v":"B4"},{"$f":"H$6&$E16","v":"N2"},{"$f":"I$6&$E17","v":"S3"},{"$f":"G17","v":"B2"},{"$f":"F15","v":"E1"},{"$f":"I16","v":"S4"},{"$f":"H18","v":"N3"},{"$f":"IF($V$1=10,0,M16)","v":"N4"},{"$f":"IF($V$1=10,0,L17)","v":"S2"},{"$f":"IF($V$1=10,0,K15)","v":"E1"},{"$f":"IF($V$1=10,0,J18)","v":"B3"},null,null,null,null,"Regionalliga Staffel 6"]
[null,null,2,{"$f":"E16","v":2},{"$f":"E15+1","v":2},{"$f":"F$6&$E16","v":"E2"},{"$f":"G$6&$E17","v":"B3"},{"$f":"H$6&$E15","v":"N1"},{"$f":"I$6&$E18","v":"S4"},{"$f":"G18","v":"B1"},"E2",{"$f":"I15","v":"S3"},{"$f":"H17","v":"N4"},{"$f":"IF($V$1=10,0,M15)","v":"N3"},{"$f":"IF($V$1=10,0,L18)","v":"S1"},"E2",{"$f":"IF($V$1=10,0,J17)","v":"B4"},null,null,null,null,"Oberliga Staffel 8"]
[null,null,3,{"$f":"E17","v":3},{"$f":"E16+1","v":3},{"$f":"F$6&$E17","v":"E3"},{"$f":"G$6&$E16","v":"B2"},{"$f":"H$6&$E18","v":"N4"},{"$f":"I$6&$E15","v":"S1"},{"$f":"G15","v":"B4"},"E3",{"$f":"I18","v":"S2"},{"$f":"H16","v":"N1"},{"$f":"IF($V$1=10,0,M18)","v":"N2"},{"$f":"IF($V$1=10,0,L15)","v":"S4"},"E3",{"$f":"IF($V$1=10,0,J16)","v":"B1"},null,null,null,null,"Landesliga Staffel 10",null,10,"Serien"]
[null,null,4,{"$f":"E18","v":4},{"$f":"E17+1","v":4},{"$f":"F$6&$E18","v":"E4"},{"$f":"G$6&$E15","v":"B1"},{"$f":"H$6&$E17","v":"N3"},{"$f":"I$6&$E16","v":"S2"},{"$f":"G16","v":"B3"},"E4",{"$f":"I17","v":"S1"},{"$f":"H15","v":"N2"},{"$f":"IF($V$1=10,0,M17)","v":"N1"},{"$f":"IF($V$1=10,0,L16)","v":"S3"},"E4",{"$f":"IF($V$1=10,0,J15)","v":"B2"},null,null,null,null,"Landesliga Staffel 11"]
[null,null,1,{"$f":"J$5","v":5},{"$f":"IF($T$2=\"alle\",E$15,\"\")","v":1},{"$f":"J$6&$E19","v":"F1"},{"$f":"K$6&$E22","v":"A4"},{"$f":"L$6&$E20","v":"M2"},{"$f":"M$6&$E21","v":"T3"},{"$f":"G21","v":"A2"},"F1",{"$f":"I20","v":"T4"},{"$f":"H22","v":"M3"},{"$f":"IF($V$1=10,0,M20)","v":"M4"},{"$f":"IF($V$1=10,0,L21)","v":"T2"},"F1",{"$f":"IF($V$1=10,0,J22)","v":"A3"},null,null,null,null,"Landesliga Staffel 15"]
[null,null,2,{"$f":"K$5","v":6},{"$f":"IF($T$2=\"alle\",E$16,\"\")","v":2},{"$f":"J$6&$E20","v":"F2"},{"$f":"K$6&$E21","v":"A3"},{"$f":"L$6&$E19","v":"M1"},{"$f":"M$6&$E22","v":"T4"},{"$f":"G22","v":"A1"},"F2",{"$f":"I19","v":"T3"},{"$f":"H21","v":"M4"},{"$f":"IF($V$1=10,0,M19)","v":"M3"},{"$f":"IF($V$1=10,0,L22)","v":"T1"},"F2",{"$f":"IF($V$1=10,0,J21)","v":"A4"}]
[null,null,3,{"$f":"L$5","v":7},{"$f":"IF($T$2=\"alle\",E$17,\"\")","v":3},{"$f":"J$6&$E21","v":"F3"},{"$f":"K$6&$E20","v":"A2"},{"$f":"L$6&$E22","v":"M4"},{"$f":"M$6&$E19","v":"T1"},{"$f":"G19","v":"A4"},"F3",{"$f":"I22","v":"T2"},{"$f":"H20","v":"M1"},{"$f":"IF($V$1=10,0,M22)","v":"M2"},{"$f":"IF($V$1=10,0,L19)","v":"T4"},"F3",{"$f":"IF($V$1=10,0,J20)","v":"A1"}]
[null,null,4,{"$f":"M$5","v":8},{"$f":"IF($T$2=\"alle\",E$18,\"\")","v":4},{"$f":"J$6&$E22","v":"F4"},{"$f":"K$6&$E19","v":"A1"},{"$f":"L$6&$E21","v":"M3"},{"$f":"M$6&$E20","v":"T2"},{"$f":"G20","v":"A3"},"F4",{"$f":"I21","v":"T1"},{"$f":"H19","v":"M2"},{"$f":"IF($V$1=10,0,M21)","v":"M1"},{"$f":"IF($V$1=10,0,L20)","v":"T3"},"F4",{"$f":"IF($V$1=10,0,J19)","v":"A2"}]
[null,null,1,{"$f":"N$5","v":9},{"$f":"IF($T$2=\"alle\",E$15,\"\")","v":1},{"$f":"N$6&$E23","v":"H1"},{"$f":"O$6&$E26","v":"D4"},{"$f":"P$6&$E24","v":"L2"},{"$f":"Q$6&$E25","v":"P3"},{"$f":"G25","v":"D2"},"H1",{"$f":"I24","v":"P4"},{"$f":"H26","v":"L3"},{"$f":"IF($V$1=10,0,M24)","v":"L4"},{"$f":"IF($V$1=10,0,L25)","v":"P2"},"H1",{"$f":"IF($V$1=10,0,J26)","v":"D3"}]
[null,null,2,{"$f":"O$5","v":10},{"$f":"IF($T$2=\"alle\",E$16,\"\")","v":2},{"$f":"N$6&$E24","v":"H2"},{"$f":"O$6&$E25","v":"D3"},{"$f":"P$6&$E23","v":"L1"},{"$f":"Q$6&$E26","v":"P4"},{"$f":"G26","v":"D1"},"H2",{"$f":"I23","v":"P3"},{"$f":"H25","v":"L4"},{"$f":"IF($V$1=10,0,M23)","v":"L3"},{"$f":"IF($V$1=10,0,L26)","v":"P1"},"H2",{"$f":"IF($V$1=10,0,J25)","v":"D4"}]
[null,null,3,{"$f":"P$5","v":11},{"$f":"IF($T$2=\"alle\",E$17,\"\")","v":3},{"$f":"N$6&$E25","v":"H3"},{"$f":"O$6&$E24","v":"D2"},{"$f":"P$6&$E26","v":"L4"},{"$f":"Q$6&$E23","v":"P1"},{"$f":"G23","v":"D4"},"H3",{"$f":"I26","v":"P2"},{"$f":"H24","v":"L1"},{"$f":"IF($V$1=10,0,M26)","v":"L2"},{"$f":"IF($V$1=10,0,L23)","v":"P4"},"H3",{"$f":"IF($V$1=10,0,J24)","v":"D1"}]
[null,null,4,{"$f":"Q$5","v":12},{"$f":"IF($T$2=\"alle\",E$18,\"\")","v":4},{"$f":"N$6&$E26","v":"H4"},{"$f":"O$6&$E23","v":"D1"},{"$f":"P$6&$E25","v":"L3"},{"$f":"Q$6&$E24","v":"P2"},{"$f":"G24","v":"D3"},"H4",{"$f":"I25","v":"P1"},{"$f":"H23","v":"L2"},{"$f":"IF($V$1=10,0,M25)","v":"L1"},{"$f":"IF($V$1=10,0,L24)","v":"P3"},"H4",{"$f":"IF($V$1=10,0,J23)","v":"D2"}]
[null,null,1,{"$f":"R$5","v":13},{"$f":"IF($T$2=\"alle\",E$15,\"\")","v":1},{"$f":"R$6&$E27","v":"J1"},{"$f":"S$6&$E30","v":"C4"},{"$f":"T$6&$E28","v":"K2"},{"$f":"U$6&$E29","v":"R3"},{"$f":"G29","v":"C2"},"J1",{"$f":"I28","v":"R4"},{"$f":"H30","v":"K3"},{"$f":"IF($V$1=10,0,M28)","v":"K4"},{"$f":"IF($V$1=10,0,L29)","v":"R2"},"J1",{"$f":"IF($V$1=10,0,J30)","v":"C3"}]
[null,null,2,{"$f":"S$5","v":14},{"$f":"IF($T$2=\"alle\",E$16,\"\")","v":2},{"$f":"R$6&$E28","v":"J2"},{"$f":"S$6&$E29","v":"C3"},{"$f":"T$6&$E27","v":"K1"},{"$f":"U$6&$E30","v":"R4"},{"$f":"G30","v":"C1"},"J2",{"$f":"I27","v":"R3"},{"$f":"H29","v":"K4"},{"$f":"IF($V$1=10,0,M27)","v":"K3"},{"$f":"IF($V$1=10,0,L30)","v":"R1"},"J2",{"$f":"IF($V$1=10,0,J29)","v":"C4"}]
[null,null,3,{"$f":"T$5","v":15},{"$f":"IF($T$2=\"alle\",E$17,\"\")","v":3},{"$f":"R$6&$E29","v":"J3"},{"$f":"S$6&$E28","v":"C2"},{"$f":"T$6&$E30","v":"K4"},{"$f":"U$6&$E27","v":"R1"},{"$f":"G27","v":"C4"},"J3",{"$f":"I30","v":"R2"},{"$f":"H28","v":"K1"},{"$f":"IF($V$1=10,0,M30)","v":"K2"},{"$f":"IF($V$1=10,0,L27)","v":"R4"},"J3",{"$f":"IF($V$1=10,0,J28)","v":"C1"}]
[null,null,4,{"$f":"U$5","v":16},{"$f":"IF($T$2=\"alle\",E$18,\"\")","v":4},{"$f":"R$6&$E30","v":"J4"},{"$f":"S$6&$E27","v":"C1"},{"$f":"T$6&$E29","v":"K3"},{"$f":"U$6&$E28","v":"R2"},{"$f":"G28","v":"C3"},"J4",{"$f":"I29","v":"R1"},{"$f":"H27","v":"K2"},{"$f":"IF($V$1=10,0,M29)","v":"K1"},{"$f":"IF($V$1=10,0,L28)","v":"R3"},"J4",{"$f":"IF($V$1=10,0,J27)","v":"C2"}]
[]
["\"HT\" für Ligaauswertung JJJJ.xlsm =>",null,null,null,null,{"$f":"F14","v":4},{"$f":"J14","v":5},{"$f":"N14","v":6},1,2,3,4,5,6,7,8,9,10,11,12,13,14,15,null,null,null,null,null,"\"HT\" für \"Startkarten.xlsx\" =>",null,"E"]
["↑ Landesoberliga 2022.xlsx",null,null,"Tisch",null,{"$f":"ROW()-31","v":2},{"$f":"F33+4","v":6},{"$f":"G33+4","v":10},null,null,null,null,null,null,null,null,null,null,null,null,null,null,null,null,null,"Spieltag:",1,null,"Serie"]
["↑ Landesliga 2019.xlsx",null,null,"11",null,{"$f":"VLOOKUP(VALUE(LEFT($D34,LEN($D34)-1)),$D$15:$Q$30,F$33+VALUE(RIGHT($D34,1)),FALSE)","v":"E1"},"B2","N4","A1","P2","E4","E1","B2","N4","K1","F2","S4","P1","N2","C4","A1","D2","B4",null,"A","Gruppe:","alle",{"$f":"AE$32&AC34","v":"E1"},1,{"$f":"INDEX($D$34:$D$112,MATCH(AB34,$I$34:$I$112,0))","v":"23"},{"$f":"INDEX($C$15:$C$30,MATCH(VALUE(IF(LEN(AD34)=2,LEFT(AD34,1),LEFT(AD34,2))),$D$15:$D$30,0))","v":2},{"$f":"RIGHT(AD34,1)","v":"3"}]
[null,null,null,"12",null,"B4","E1","S2","P4","A1","K2","B4","E1","S2","F4","K1","D2","N4","P1","F2","D4","A1","C2",null,"B",null,null,null,2,{"$f":"INDEX($D$34:$D$112,MATCH(AB34,$J$34:$J$112,0))","v":"34"},3,{"$f":"RIGHT(AD35,1)","v":"4"}]
[null,null,null,"13",null,"N2","S4","E1","E2","K4","A1","N2","S4","E1","S2","D4","K1","C2","F4","P1","B2","C4","A1",null,"C",null,null,null,3,{"$f":"INDEX($D$34:$D$112,MATCH(AB34,$K$34:$K$112,0))","v":"41"},4,"1"]
[null,null,null,"14",null,"S3","N3","B3","K3","E3","P3","S3","N3","B3","D3","S3","F3","F3","C3","N3","C3","B3","D3",null,"D",null,null,null,4,{"$f":"INDEX($D$34:$D$112,MATCH(AB34,$L$34:$L$112,0))","v":"11"},1,"1"]
[null,null,null,1,null,null,null,null,null,null,null,null,null,null,null,null,null,null,null,null,null,null,null,null,"E",null,null,null,5,{"$f":"INDEX($D$34:$D$112,MATCH(AB34,$M$34:$M$112,0))","v":"12"},1,"2"]
[null,null,null,"21",null,{"$f":"VLOOKUP(VALUE(LEFT($D39,LEN($D39)-1)),$D$15:$Q$30,F$33+VALUE(RIGHT($D39,1)),FALSE)","v":"E2"},"B1","N3","A2","P1","E3","E2","B1","N3","K2","F1","S3","P2","N1","C3","A2","D1","B3",null,"F",null,null,null,6,{"$f":"INDEX($D$34:$D$112,MATCH(AB34,$N$34:$N$112,0))","v":"13"},1,"3"]
[null,null,null,"22",null,"B3","E2","S1","P3","A2","K1","B3","E2","S1","F3","K2","D1","N3","P2","F1","D3","A2","C1",null,"H",null,null,null,7,{"$f":"INDEX($D$34:$D$112,MATCH(AB34,$O$34:$O$112,0))","v":"82"},4,"2"]
[null,null,null,"23",null,"N1","S3","E2","E1","K3","A2","N1","S3","E2","S1","D3","K2","C1","F3","P2","B1","C3","A2",null,"J",null,null,null,8,{"$f":"INDEX($D$34:$D$112,MATCH(AB34,$P$34:$P$112,0))","v":"61"},2,"1"]
[null,null,null,"24",null,"S4","N4","B4","K4","E4","P4","S4","N4","B4","D4","S4","F4","F4","C4","N4","C4","B4","D4",null,"K",null,null,null,9,{"$f":"INDEX($D$34:$D$112,MATCH(AB34,$Q$34:$Q$112,0))","v":"74"},3,"4"]
[null,null,null,2,null,null,null,null,null,null,null,null,null,null,null,null,null,null,null,null,null,null,null,null,"L",null,null,null,10,{"$f":"INDEX($D$34:$D$112,MATCH(AB34,$R$34:$R$112,0))","v":"74"},3,"4"]
[null,null,null,"31",null,{"$f":"VLOOKUP(VALUE(LEFT($D44,LEN($D44)-1)),$D$15:$Q$30,F$33+VALUE(RIGHT($D44,1)),FALSE)","v":"E3"},"B4","N2","A3","P4","E2","E3","B4","N2","K3","F4","S2","P3","N4","C2","A3","D4","B2",null,"M",null,null,null,11,{"$f":"INDEX($D$34:$D$112,MATCH(AB34,$S$34:$S$112,0))","v":"83"},4,"3"]
[null,null,null,"32",null,"B2","E3","S4","P2","A3","K4","B2","E3","S4","F2","K3","D4","N2","P3","F4","D2","A3","C4",null,"N",null,null,null,12,{"$f":"INDEX($D$34:$D$112,MATCH(AB34,$T$34:$T$112,0))","v":"62"},2,"2"]
[null,null,null,"33",null,"N4","S2","E3","E4","K2","A3","N4","S2","E3","S4","D2","K3","C4","F2","P3","B4","C2","A3",null,"P",null,null,null,13,{"$f":"INDEX($D$34:$D$112,MATCH(AB34,$U$34:$U$112,0))","v":"51"},{"$f":"IF(LEN(AD46)=2,LEFT(AD46,1),LEFT(AD46,2))","v":"5"},"1"]
[null,null,null,"34",null,"S1","N1","B1","K1","E1","P1","S1","N1","B1","D1","S1","F1","F1","C1","N1","C1","B1","D1",null,"R",null,null,null,14,{"$f":"INDEX($D$34:$D$112,MATCH(AB34,$V$34:$V$112,0))","v":"52"},{"$f":"IF(LEN(AD47)=2,LEFT(AD47,1),LEFT(AD47,2))","v":"5"},"2"]
[null,null,null,3,null,null,null,null,null,null,null,null,null,null,null,null,null,null,null,null,null,null,null,null,"S",null,null,null,15,{"$f":"INDEX($D$34:$D$112,MATCH(AB34,$W$34:$W$112,0))","v":"53"},{"$f":"IF(LEN(AD48)=2,LEFT(AD48,1),LEFT(AD48,2))","v":"5"},"3"]
[null,null,null,"41",null,{"$f":"VLOOKUP(VALUE(LEFT($D49,LEN($D49)-1)),$D$15:$Q$30,F$33+VALUE(RIGHT($D49,1)),FALSE)","v":"E4"},"B3","N1","A4","P3","E1","E4","B3","N1","K4","F3","S1","P4","N3","C1","A4","D3","B1",null,"T"]
[null,null,null,"42",null,"B1","E4","S3","P1","A4","K3","B1","E4","S3","F1","K4","D3","N1","P4","F3","D1","A4","C3"]
[null,null,null,"43",null,"N3","S1","E4","E3","K1","A4","N3","S1","E4","S3","D1","K4","C3","F1","P4","B3","C1","A4"]
[null,null,null,"44",null,"S2","N2","B2","K2","E2","P2","S2","N2","B2","D2","S2","F2","F2","C2","N2","C2","B2","D2"]
[null,null,null,4]
[null,null,null,"51",null,{"$f":"VLOOKUP(VALUE(LEFT($D54,LEN($D54)-1)),$D$15:$Q$30,F$33+VALUE(RIGHT($D54,1)),FALSE)","v":"F1"},"A2","M4","B1","R2","F4","F1","A2","M4","L1","E2","T4","R1","M2","D4","E1","J2","F4"]
[null,null,null,"52",null,"A4","F1","T2","R4","B1","L2","A4","F1","T2","E4","L1","C2","M4","R1","E2","J4","E1","H2",null,null,null,null,{"$f":"AE$32&AC56","v":"E2"},1,{"$f":"INDEX($D$34:$D$112,MATCH(AB55,$I$34:$I$112,0))","v":"13"},{"$f":"INDEX($C$15:$C$30,MATCH(VALUE(IF(LEN(AD55)=2,LEFT(AD55,1),LEFT(AD55,2))),$D$15:$D$30,0))","v":1},{"$f":"RIGHT(AD55,1)","v":"3"}]
[null,null,null,"53",null,"M2","T4","F1","F2","L4","B1","M2","T4","F1","T2","C4","L1","D2","E4","R1","F2","H4","E1",null,null,null,null,null,2,{"$f":"INDEX($D$34:$D$112,MATCH(AB55,$J$34:$J$112,0))","v":"44"},4,{"$f":"RIGHT(AD56,1)","v":"4"}]
[null,null,null,"54",null,"T3","M3","A3","L3","F3","R3","T3","M3","A3","C3","T3","E3","E3","D3","M3","H3","F3","J3",null,null,null,null,null,3,{"$f":"INDEX($D$34:$D$112,MATCH(AB55,$K$34:$K$112,0))","v":"31"},3,"1"]
[null,null,null,5,null,null,null,null,null,null,null,null,null,null,null,null,null,null,null,null,null,null,null,null,null,null,null,null,4,{"$f":"INDEX($D$34:$D$112,MATCH(AB55,$L$34:$L$112,0))","v":"21"},2,"1"]
[null,null,null,"61",null,{"$f":"VLOOKUP(VALUE(LEFT($D59,LEN($D59)-1)),$D$15:$Q$30,F$33+VALUE(RIGHT($D59,1)),FALSE)","v":"F2"},"A1","M3","B2","R1","F3","F2","A1","M3","L2","E1","T3","R2","M1","D3","E2","J1","F3",null,null,null,null,null,5,{"$f":"INDEX($D$34:$D$112,MATCH(AB55,$M$34:$M$112,0))","v":"22"},2,"2"]
[null,null,null,"62",null,"A3","F2","T1","R3","B2","L1","A3","F2","T1","E3","L2","C1","M3","R2","E1","J3","E2","H1",null,null,null,null,null,6,{"$f":"INDEX($D$34:$D$112,MATCH(AB55,$N$34:$N$112,0))","v":"23"},2,"3"]
[null,null,null,"63",null,"M1","T3","F2","F1","L3","B2","M1","T3","F2","T1","C3","L2","D1","E3","R2","F1","H3","E2",null,null,null,null,null,7,{"$f":"INDEX($D$34:$D$112,MATCH(AB55,$O$34:$O$112,0))","v":"72"},3,"2"]
[null,null,null,"64",null,"T4","M4","A4","L4","F4","R4","T4","M4","A4","C4","T4","E4","E4","D4","M4","H4","F4","J4",null,null,null,null,null,8,{"$f":"INDEX($D$34:$D$112,MATCH(AB55,$P$34:$P$112,0))","v":"51"},1,"1"]
[null,null,null,6,null,null,null,null,null,null,null,null,null,null,null,null,null,null,null,null,null,null,null,null,null,null,null,null,9,{"$f":"INDEX($D$34:$D$112,MATCH(AB55,$Q$34:$Q$112,0))","v":"84"},4,"4"]
[null,null,null,"71",null,{"$f":"VLOOKUP(VALUE(LEFT($D64,LEN($D64)-1)),$D$15:$Q$30,F$33+VALUE(RIGHT($D64,1)),FALSE)","v":"F3"},"A4","M2","B3","R4","F2","F3","A4","M2","L3","E4","T2","R3","M4","D2","E3","J4","F2",null,null,null,null,null,10,{"$f":"INDEX($D$34:$D$112,MATCH(AB55,$R$34:$R$112,0))","v":"84"},4,"4"]
[null,null,null,"72",null,"A2","F3","T4","R2","B3","L4","A2","F3","T4","E2","L3","C4","M2","R3","E4","J2","E3","H4",null,null,null,null,null,11,{"$f":"INDEX($D$34:$D$112,MATCH(AB55,$S$34:$S$112,0))","v":"73"},3,"3"]
[null,null,null,"73",null,"M4","T2","F3","F4","L2","B3","M4","T2","F3","T4","C2","L3","D4","E2","R3","F4","H2","E3",null,null,null,null,null,12,{"$f":"INDEX($D$34:$D$112,MATCH(AB55,$T$34:$T$112,0))","v":"52"},1,"2"]
[null,null,null,"74",null,"T1","M1","A1","L1","F1","R1","T1","M1","A1","C1","T1","E1","E1","D1","M1","H1","F1","J1",null,null,null,null,null,13,{"$f":"INDEX($D$34:$D$112,MATCH(AB55,$U$34:$U$112,0))","v":"61"},{"$f":"IF(LEN(AD67)=2,LEFT(AD67,1),LEFT(AD67,2))","v":"6"},"1"]
[null,null,null,7,null,null,null,null,null,null,null,null,null,null,null,null,null,null,null,null,null,null,null,null,null,null,null,null,14,{"$f":"INDEX($D$34:$D$112,MATCH(AB55,$V$34:$V$112,0))","v":"62"},{"$f":"IF(LEN(AD68)=2,LEFT(AD68,1),LEFT(AD68,2))","v":"6"},"2"]
[null,null,null,"81",null,{"$f":"VLOOKUP(VALUE(LEFT($D69,LEN($D69)-1)),$D$15:$Q$30,F$33+VALUE(RIGHT($D69,1)),FALSE)","v":"F4"},"A3","M1","B4","R3","F1","F4","A3","M1","L4","E3","T1","R4","M3","D1","E4","J3","F1",null,null,null,null,null,15,{"$f":"INDEX($D$34:$D$112,MATCH(AB55,$W$34:$W$112,0))","v":"63"},{"$f":"IF(LEN(AD69)=2,LEFT(AD69,1),LEFT(AD69,2))","v":"6"},"3"]
[null,null,null,"82",null,"A1","F4","T3","R1","B4","L3","A1","F4","T3","E1","L4","C3","M1","R4","E3","J1","E4","H3"]
[null,null,null,"83",null,"M3","T1","F4","F3","L1","B4","M3","T1","F4","T3","C1","L4","D3","E1","R4","F3","H1","E4"]
[null,null,null,"84",null,"T2","M2","A2","L2","F2","R2","T2","M2","A2","C2","T2","E2","E2","D2","M2","H2","F2","J2"]
[null,null,null,8]
[null,null,null,"91",null,{"$f":"VLOOKUP(VALUE(LEFT($D74,LEN($D74)-1)),$D$15:$Q$30,F$33+VALUE(RIGHT($D74,1)),FALSE)","v":"H1"},"D2","L4","C1","S2","H4","H1","D2","L4","M1","J2","P4","S1","L2","A4","K1","N2","L4",null,null,null,null,{"$f":"AE$32&AC76","v":"E3"},1,{"$f":"INDEX($D$34:$D$112,MATCH(AB74,$I$34:$I$112,0))","v":"43"},{"$f":"INDEX($C$15:$C$30,MATCH(VALUE(IF(LEN(AD74)=2,LEFT(AD74,1),LEFT(AD74,2))),$D$15:$D$30,0))","v":4},{"$f":"RIGHT(AD74,1)","v":"3"}]
[null,null,null,"92",null,"D4","H1","P2","S4","C1","M2","D4","H1","P2","J4","M1","B2","L4","S1","J2","N4","K1","M2",null,null,null,null,null,2,{"$f":"INDEX($D$34:$D$112,MATCH(AB74,$J$34:$J$112,0))","v":"14"},1,{"$f":"RIGHT(AD75,1)","v":"4"}]
[null,null,null,"93",null,"L2","P4","H1","H2","M4","C1","L2","P4","H1","P2","B4","M1","A2","J4","S1","L2","M4","K1",null,null,null,null,null,3,{"$f":"INDEX($D$34:$D$112,MATCH(AB74,$K$34:$K$112,0))","v":"21"},2,"1"]
[null,null,null,"94",null,"P3","L3","D3","M3","H3","S3","P3","L3","D3","B3","P3","J3","J3","A3","L3","M3","L3","N3",null,null,null,null,null,4,{"$f":"INDEX($D$34:$D$112,MATCH(AB74,$L$34:$L$112,0))","v":"31"},3,"1"]
[null,null,null,9,null,null,null,null,null,null,null,null,null,null,null,null,null,null,null,null,null,null,null,null,null,null,null,null,5,{"$f":"INDEX($D$34:$D$112,MATCH(AB74,$M$34:$M$112,0))","v":"32"},3,"2"]
[null,null,null,"101",null,{"$f":"VLOOKUP(VALUE(LEFT($D79,LEN($D79)-1)),$D$15:$Q$30,F$33+VALUE(RIGHT($D79,1)),FALSE)","v":"H2"},"D1","L3","C2","S1","H3","H2","D1","L3","M2","J1","P3","S2","L1","A3","K2","N1","L3",null,null,null,null,null,6,{"$f":"INDEX($D$34:$D$112,MATCH(AB74,$N$34:$N$112,0))","v":"33"},3,"3"]
[null,null,null,"102",null,"D3","H2","P1","S3","C2","M1","D3","H2","P1","J3","M2","B1","L3","S2","J1","N3","K2","M1",null,null,null,null,null,7,{"$f":"INDEX($D$34:$D$112,MATCH(AB74,$O$34:$O$112,0))","v":"62"},2,"2"]
[null,null,null,"103",null,"L1","P3","H2","H1","M3","C2","L1","P3","H2","P1","B3","M2","A1","J3","S2","L1","M3","K2",null,null,null,null,null,8,{"$f":"INDEX($D$34:$D$112,MATCH(AB74,$P$34:$P$112,0))","v":"81"},4,"1"]
[null,null,null,"104",null,"P4","L4","D4","M4","H4","S4","P4","L4","D4","B4","P4","J4","J4","A4","L4","M4","L4","N4",null,null,null,null,null,9,{"$f":"INDEX($D$34:$D$112,MATCH(AB74,$Q$34:$Q$112,0))","v":"54"},1,"4"]
[null,null,null,10,null,null,null,null,null,null,null,null,null,null,null,null,null,null,null,null,null,null,null,null,null,null,null,null,10,{"$f":"INDEX($D$34:$D$112,MATCH(AB74,$R$34:$R$112,0))","v":"54"},1,"4"]
[null,null,null,"111",null,{"$f":"VLOOKUP(VALUE(LEFT($D84,LEN($D84)-1)),$D$15:$Q$30,F$33+VALUE(RIGHT($D84,1)),FALSE)","v":"H3"},"D4","L2","C3","S4","H2","H3","D4","L2","M3","J4","P2","S3","L4","A2","K3","N4","L2",null,null,null,null,null,11,{"$f":"INDEX($D$34:$D$112,MATCH(AB74,$S$34:$S$112,0))","v":"63"},2,"3"]
[null,null,null,"112",null,"D2","H3","P4","S2","C3","M4","D2","H3","P4","J2","M3","B4","L2","S3","J4","N2","K3","M4",null,null,null,null,null,12,{"$f":"INDEX($D$34:$D$112,MATCH(AB74,$T$34:$T$112,0))","v":"82"},4,"2"]
[null,null,null,"113",null,"L4","P2","H3","H4","M2","C3","L4","P2","H3","P4","B2","M3","A4","J2","S3","L4","M2","K3",null,null,null,null,null,13,{"$f":"INDEX($D$34:$D$112,MATCH(AB74,$U$34:$U$112,0))","v":"71"},{"$f":"IF(LEN(AD86)=2,LEFT(AD86,1),LEFT(AD86,2))","v":"7"},"1"]
[null,null,null,"114",null,"P1","L1","D1","M1","H1","S1","P1","L1","D1","B1","P1","J1","J1","A1","L1","M1","L1","N1",null,null,null,null,null,14,{"$f":"INDEX($D$34:$D$112,MATCH(AB74,$V$34:$V$112,0))","v":"72"},{"$f":"IF(LEN(AD87)=2,LEFT(AD87,1),LEFT(AD87,2))","v":"7"},"2"]
[null,null,null,11,null,null,null,null,null,null,null,null,null,null,null,null,null,null,null,null,null,null,null,null,null,null,null,null,15,{"$f":"INDEX($D$34:$D$112,MATCH(AB74,$W$34:$W$112,0))","v":"73"},{"$f":"IF(LEN(AD88)=2,LEFT(AD88,1),LEFT(AD88,2))","v":"7"},"3"]
[null,null,null,"121",null,{"$f":"VLOOKUP(VALUE(LEFT($D89,LEN($D89)-1)),$D$15:$Q$30,F$33+VALUE(RIGHT($D89,1)),FALSE)","v":"H4"},"D3","L1","C4","S3","H1","H4","D3","L1","M4","J3","P1","S4","L3","A1","K4","N3","L1"]
[null,null,null,"122",null,"D1","H4","P3","S1","C4","M3","D1","H4","P3","J1","M4","B3","L1","S4","J3","N1","K4","M3"]
[null,null,null,"123",null,"L3","P1","H4","H3","M1","C4","L3","P1","H4","P3","B1","M4","A3","J1","S4","L3","M1","K4"]
[null,null,null,"124",null,"P2","L2","D2","M2","H2","S2","P2","L2","D2","B2","P2","J2","J2","A2","L2","M2","L2","N2"]
[null,null,null,12]
[null,null,null,"131",null,{"$f":"VLOOKUP(VALUE(LEFT($D94,LEN($D94)-1)),$D$15:$Q$30,F$33+VALUE(RIGHT($D94,1)),FALSE)","v":"J1"},"C2","K4","D1","T2","J4","J1","C2","K4","N1","H2","R4","T1","K2","B4","P1","T2","R4"]
[null,null,null,"132",null,"C4","J1","R2","T4","D1","N2","C4","J1","R2","H4","N1","A2","K4","T1","H2","T4","P1","S2",null,null,null,null,{"$f":"AE$32&AC98","v":"E4"},1,{"$f":"INDEX($D$34:$D$112,MATCH(AB95,$I$34:$I$112,0))","v":"33"},{"$f":"INDEX($C$15:$C$30,MATCH(VALUE(IF(LEN(AD95)=2,LEFT(AD95,1),LEFT(AD95,2))),$D$15:$D$30,0))","v":3},{"$f":"RIGHT(AD95,1)","v":"3"}]
[null,null,null,"133",null,"K2","R4","J1","J2","N4","D1","K2","R4","J1","R2","A4","N1","B2","H4","T1","R2","S4","P1",null,null,null,null,null,2,{"$f":"INDEX($D$34:$D$112,MATCH(AB95,$J$34:$J$112,0))","v":"24"},2,{"$f":"RIGHT(AD96,1)","v":"4"}]
[null,null,null,"134",null,"R3","K3","C3","N3","J3","T3","R3","K3","C3","A3","R3","H3","H3","B3","K3","S3","R3","T3",null,null,null,null,null,3,{"$f":"INDEX($D$34:$D$112,MATCH(AB95,$K$34:$K$112,0))","v":"11"},1,"1"]
[null,null,null,13,null,null,null,null,null,null,null,null,null,null,null,null,null,null,null,null,null,null,null,null,null,null,null,null,4,{"$f":"INDEX($D$34:$D$112,MATCH(AB95,$L$34:$L$112,0))","v":"41"},4,"1"]
[null,null,null,"141",null,{"$f":"VLOOKUP(VALUE(LEFT($D99,LEN($D99)-1)),$D$15:$Q$30,F$33+VALUE(RIGHT($D99,1)),FALSE)","v":"J2"},"C1","K3","D2","T1","J3","J2","C1","K3","N2","H1","R3","T2","K1","B3","P2","T1","R3",null,null,null,null,null,5,{"$f":"INDEX($D$34:$D$112,MATCH(AB95,$M$34:$M$112,0))","v":"42"},4,"2"]
[null,null,null,"142",null,"C3","J2","R1","T3","D2","N1","C3","J2","R1","H3","N2","A1","K3","T2","H1","T3","P2","S1",null,null,null,null,null,6,{"$f":"INDEX($D$34:$D$112,MATCH(AB95,$N$34:$N$112,0))","v":"43"},4,"3"]
[null,null,null,"143",null,"K1","R3","J2","J1","N3","D2","K1","R3","J2","R1","A3","N2","B1","H3","T2","R1","S3","P2",null,null,null,null,null,7,{"$f":"INDEX($D$34:$D$112,MATCH(AB95,$O$34:$O$112,0))","v":"52"},1,"2"]
[null,null,null,"144",null,"R4","K4","C4","N4","J4","T4","R4","K4","C4","A4","R4","H4","H4","B4","K4","S4","R4","T4",null,null,null,null,null,8,{"$f":"INDEX($D$34:$D$112,MATCH(AB95,$P$34:$P$112,0))","v":"71"},3,"1"]
[null,null,null,14,null,null,null,null,null,null,null,null,null,null,null,null,null,null,null,null,null,null,null,null,null,null,null,null,9,{"$f":"INDEX($D$34:$D$112,MATCH(AB95,$Q$34:$Q$112,0))","v":"64"},2,"4"]
[null,null,null,"151",null,{"$f":"VLOOKUP(VALUE(LEFT($D104,LEN($D104)-1)),$D$15:$Q$30,F$33+VALUE(RIGHT($D104,1)),FALSE)","v":"J3"},"C4","K2","D3","T4","J2","J3","C4","K2","N3","H4","R2","T3","K4","B2","P3","T4","R2",null,null,null,null,null,10,{"$f":"INDEX($D$34:$D$112,MATCH(AB95,$R$34:$R$112,0))","v":"64"},2,"4"]
[null,null,null,"152",null,"C2","J3","R4","T2","D3","N4","C2","J3","R4","H2","N3","A4","K2","T3","H4","T2","P3","S4",null,null,null,null,null,11,{"$f":"INDEX($D$34:$D$112,MATCH(AB95,$S$34:$S$112,0))","v":"53"},1,"3"]
[null,null,null,"153",null,"K4","R2","J3","J4","N2","D3","K4","R2","J3","R4","A2","N3","B4","H2","T3","R4","S2","P3",null,null,null,null,null,12,{"$f":"INDEX($D$34:$D$112,MATCH(AB95,$T$34:$T$112,0))","v":"72"},3,"2"]
[null,null,null,"154",null,"R1","K1","C1","N1","J1","T1","R1","K1","C1","A1","R1","H1","H1","B1","K1","S1","R1","T1",null,null,null,null,null,13,{"$f":"INDEX($D$34:$D$112,MATCH(AB95,$U$34:$U$112,0))","v":"81"},{"$f":"IF(LEN(AD107)=2,LEFT(AD107,1),LEFT(AD107,2))","v":"8"},"1"]
[null,null,null,15,null,null,null,null,null,null,null,null,null,null,null,null,null,null,null,null,null,null,null,null,null,null,null,null,14,{"$f":"INDEX($D$34:$D$112,MATCH(AB95,$V$34:$V$112,0))","v":"82"},{"$f":"IF(LEN(AD108)=2,LEFT(AD108,1),LEFT(AD108,2))","v":"8"},"2"]
[null,null,null,"161",null,{"$f":"VLOOKUP(VALUE(LEFT($D109,LEN($D109)-1)),$D$15:$Q$30,F$33+VALUE(RIGHT($D109,1)),FALSE)","v":"J4"},"C3","K1","D4","T3","J1","J4","C3","K1","N4","H3","R1","T4","K3","B1","P4","T3","R1",null,null,null,null,null,15,{"$f":"INDEX($D$34:$D$112,MATCH(AB95,$W$34:$W$112,0))","v":"83"},{"$f":"IF(LEN(AD109)=2,LEFT(AD109,1),LEFT(AD109,2))","v":"8"},"3"]
[null,null,null,"162",null,"C1","J4","R3","T1","D4","N3","C1","J4","R3","H1","N4","A3","K1","T4","H3","T1","P4","S3"]
[null,null,null,"163",null,"K3","R1","J4","J3","N1","D4","K3","R1","J4","R3","A1","N4","B3","H1","T4","R3","S1","P4"]
[null,null,null,"164",null,"R2","K2","C2","N2","J2","T2","R2","K2","C2","A2","R2","H2","H2","B2","K2","S2","R2","T2"]
[null,null,null,16]

{"sheet":"48er komplett","index":1,"n_rows":60,"n_cols":25,"rows_kept":60,"cut":false,"hidden":false,"merged":[[1,0,4,0],[1,1,4,1],[1,2,4,2],[1,10,3,11],[2,9,4,9],[2,8,4,8],[1,4,1,9],[1,3,4,3],[2,7,4,7],[2,4,4,4],[2,5,4,5],[2,6,4,6],[1,24,4,24],[1,21,1,23],[1,12,1,14],[1,15,1,17],[1,18,1,20]]}
[null,{"$f":"Liga!F2","v":"Regionalliga Staffel 6"},null,null,null,null,null,null,null,null,null,null,null,null,"Datum :",{"$f":"Liga!O2","v":"2025-04-05"},null,null,"Serie :",14,null,"Tisch : ",12]
["Lfd. Nr. der Spiele"," 9\n10\n11\n12\n23\n24","Grundwerte","Buben/Spitzen","Gewinnstufen",null,null,null,null,null,"Spiel -\nwerte",null,"Name, Vorname\n(Listenführer)",null,null,"Name, Vorname",null,null,"Name, Vorname\n(Listenführer)",null,null,"Name, Vorname",null,null,"eingepaßte Spiele"]
[null,null,null,null,"Handspiel","Schneider","- angesagt","Schwarz","- angesagt","offen"]
[null,null,null,null,null,null,null,null,null,null,null,null,"Start Nr.:","N3",null,"Start Nr.:","K4",null,"Start Nr.:","M1",null,"Start Nr.:","L2"]
[null,null,null,null,null,null,null,null,null,null,"+","-","Platz 1","gew.","verl.","Platz 2","gew.","verl.","Platz 3","gew.","verl.","Platz 4","gew.","verl."]
[{"$f":"ROW()-5","v":1}]
[2]
[3]
[4]
[5]
[6]
[7]
[8]
[9]
[10]
[11]
[12]
[13]
[14]
[15]
[16]
[17]
[18]
[19]
[20]
[21]
[22]
[23]
[24]
[25]
[26]
[27]
[28]
[29]
[30]
[31]
[32]
[33]
[34]
[35]
[36]
[37]
[38]
[39]
[40]
[41]
[42]
[43]
[44]
[45]
[46]
[47]
[48]
[null,"A)","Spielpunkte :"]
["( + gewonnene - verlorene Spiele ) x 50"]
["+ verl. Sp. d. Geg.sp. x 40 am 3erTisch, 30 am 4erTisch"]
[null,"B)","Gesamtpunkte = Endergebnis"]
["Verlustgeld :",null,null,null,null,"€",null,null,null,null,"Unterschriften :"]
[null,"Nach beendetem Spiel ist die Spielliste in Gegenwart sämtlicher Mitspieler aufzurechnen, eigenhändig"]
[null,"deutlich von jedem Teilnehmer zu unterschreiben und einem Mitglied der Spielleitung zu übergeben."]

{"sheet":"nur Datendruck","index":2,"n_rows":4,"n_cols":23,"rows_kept":4,"cut":false,"hidden":false,"merged":[]}
[null,null,null,null,null,null,{"$f":"Liga!F2","v":"Regionalliga Staffel 6"},null,null,null,null,null,null,null,null,{"$f":"Liga!O2","v":"2025-04-05"},null,null,null,15,null,null,16]
[]
[]
[null,null,null,null,null,null,null,null,null,null,null,null,null,"R1",null,null,"S3",null,null,"P4",null,null,"T2"]

{"sheet":"48er - Muster für Datendruck","index":3,"n_rows":60,"n_cols":25,"rows_kept":60,"cut":false,"hidden":false,"merged":[[1,24,4,24],[1,21,1,23],[1,12,1,14],[1,15,1,17],[1,18,1,20],[1,0,4,0],[1,1,4,1],[1,2,4,2],[1,10,3,11],[2,9,4,9],[2,8,4,8],[1,4,1,9],[1,3,4,3],[2,7,4,7],[2,4,4,4],[2,5,4,5],[2,6,4,6]]}
[null,null,null,null,null,null,null,null,null,null,null,null,null,null,"Datum :",null,null,null,"Serie :",null,null,"Tisch : "]
["Lfd. Nr. der Spiele"," 9\n10\n11\n12\n23\n24","Grundwerte","Buben/Spitzen","Gewinnstufen",null,null,null,null,null,"Spiel -\nwerte",null,"Name, Vorname\n(Listenführer)",null,null,"Name, Vorname",null,null,"Name, Vorname\n(Listenführer)",null,null,"Name, Vorname",null,null,"eingepaßte Spiele"]
[null,null,null,null,"Handspiel","Schneider","- angesagt","Schwarz","- angesagt","offen"]
[null,null,null,null,null,null,null,null,null,null,null,null,"Start Nr.:",null,null,"Start Nr.:",null,null,"Start Nr.:",null,null,"Start Nr.:"]
[null,null,null,null,null,null,null,null,null,null,"+","-","Platz 1","gew.","verl.","Platz 2","gew.","verl.","Platz 3","gew.","verl.","Platz 4","gew.","verl."]
[{"$f":"ROW()-5","v":1}]
[2]
[3]
[4]
[5]
[6]
[7]
[8]
[9]
[10]
[11]
[12]
[13]
[14]
[15]
[16]
[17]
[18]
[19]
[20]
[21]
[22]
[23]
[24]
[25]
[26]
[27]
[28]
[29]
[30]
[31]
[32]
[33]
[34]
[35]
[36]
[37]
[38]
[39]
[40]
[41]
[42]
[43]
[44]
[45]
[46]
[47]
[48]
[null,"A)","Spielpunkte :"]
["( + gewonnene - verlorene Spiele ) x 50"]
["+ verl. Sp. d. Geg.sp. x 40 am 3erTisch, 30 am 4erTisch"]
[null,"B)","Gesamtpunkte = Endergebnis"]
["Verlustgeld :",null,null,null,null,"€",null,null,null,null,"Unterschriften :"]
[null,"Nach beendetem Spiel ist die Spielliste in Gegenwart sämtlicher Mitspieler aufzurechnen, eigenhändig"]
[null,"deutlich von jedem Teilnehmer zu unterschreiben und einem Mitglied der Spielleitung zu übergeben."]

{"sheet":"Anlage 7","index":4,"n_rows":79,"n_cols":17,"rows_kept":79,"cut":false,"hidden":false,"merged":[]}
["Deutscher Skatverband e.V.",null,null,null,null,null,null,null,null,null,"Anlage 9 zur Sportordnung\nab 01.01.2008"]
[null,"Tisch- und Platzordnung"]
[null,1,null,null,null,2,null,null,null,3,null,null,null,4]
["Platz",1,2,3,4,1,2,3,4,1,2,3,4,1,2,3,4]
["1. Spieltag","Serie 1"]
["Tisch 1","A1","P4","E2","K3","B1","R4","F2","L3","C1","S4","H2","M3","D1","T4","J2","N3"]
["Tisch 2","A2","P3","E1","K4","B2","R3","F1","L4","C2","S3","H1","M4","D2","T3","J1","N4"]
["Tisch 3","A3","P2","E4","K1","B3","R2","F4","L1","C3","S2","H4","M1","D3","T2","J4","N1"]
["Tisch 4","A4","P1","E3","K2","B4","R1","F3","L2","C4","S1","H3","M2","D4","T1","J3","N2"]
[null,"Serie 2"]
["Tisch 1","P2","A1","K4","E3","R2","B1","L4","F3","S2","C1","M4","H3","T2","D1","N4","J3"]
["Tisch 2","P1","A2","K3","E4","R1","B2","L3","F4","S1","C2","M3","H4","T1","D2","N3","J4"]
["Tisch 3","P4","A3","K2","E1","R4","B3","L2","F1","S4","C3","M2","H1","T4","D3","N2","J1"]
["Tisch 4","P3","A4","K1","E2","R3","B4","L1","F2","S3","C4","M1","H2","T3","D4","N1","J2"]
[null,"Serie 3"]
["Tisch 1","E4","K2","A1","P3","F4","L2","B1","R3","H4","M2","C1","S3","J4","N2","D1","T3"]
["Tisch 2","E3","K1","A2","P4","F3","L1","B2","R4","H3","M1","C2","S4","J3","N1","D2","T4"]
["Tisch 3","E2","K4","A3","P1","F2","L4","B3","R1","H2","M4","C3","S1","J2","N4","D3","T1"]
["Tisch 4","E1","K3","A4","P2","F1","L3","B4","R2","H1","M3","C4","S2","J1","N3","D4","T2"]
["2. Spieltag","Serie 4"]
["Tisch 1","E1","B4","N2","S3","F1","A4","M2","T3","H1","D4","L2","P3","J1","C4","K2","R3"]
["Tisch 2","E2","B3","N1","S4","F2","A3","M1","T4","H2","D3","L1","P4","J2","C3","K1","R4"]
["Tisch 3","E3","B2","N4","S1","F3","A2","M4","T1","H3","D2","L4","P1","J3","C2","K4","R1"]
["Tisch 4","E4","B1","N3","S2","F4","A1","M3","T2","H4","D1","L3","P2","J4","C1","K3","R2"]
[null,"Serie 5"]
["Tisch 1","B2","E1","S4","N3","A2","F1","T4","M3","D2","H1","P4","L3","C2","J1","R4","K3"]
["Tisch 2","B1","E2","S3","N4","A1","F2","T3","M4","D1","H2","P3","L4","C1","J2","R3","K4"]
["Tisch 3","B4","E3","S2","N1","A4","F3","T2","M1","D4","H3","P2","L1","C4","J3","R2","K1"]
["Tisch 4","B3","E4","S1","N2","A3","F4","T1","M2","D3","H4","P1","L2","C3","J4","R1","K2"]
[null,"Serie 6"]
["Tisch 1","N4","S2","E1","B3","M4","T2","F1","A3","L4","P2","H1","D3","K4","R2","J1","C3"]
["Tisch 2","N3","S1","E2","B4","M3","T1","F2","A4","L3","P1","H2","D4","K3","R1","J2","C4"]
["Tisch 3","N2","S4","E3","B1","M2","T4","F3","A1","L2","P4","H3","D1","K2","R4","J3","C1"]
["Tisch 4 ","N1","S3","E4","B2","M1","T3","F4","A2","L1","P3","H4","D2","K1","R3","J4","C2"]
["3. Spieltag","Serie 7"]
["Tisch 1","K1","F4","S2","D3","L1","E4","T2","C3","M1","J4","P2","B3","N1","H4","R2","A3"]
["Tisch 2","K2","F3","S1","D4","L2","E3","T1","C4","M2","J3","P1","B4","N2","H3","R1","A4"]
["Tisch 3","K3","F2","S4","D1","L3","E2","T4","C1","M3","J2","P4","B1","N3","H2","R4","A1"]
["Tisch 4","K4","F1","S3","D2","L4","E1","T3","C2","M4","J1","P3","B2","N4","H1","R3","A2"]
[null,"Serie 8"]
["Tisch 1","F2","K1","D4","S3","E2","L1","C4","T3","J2","M1","B4","P3","H2","N1","A4","R3"]
["Tisch 2","F1","K2","D3","S4","E1","L2","C3","T4","J1","M2","B3","P4","H1","N2","A3","R4"]
["Tisch 3","F4","K3","D2","S1","E4","L3","C2","T1","J4","M3","B2","P1","H4","N3","A2","R1"]
["Tisch 4","F3","K4","D1","S2","E3","L4","C1","T2","J3","M4","B1","P2","H3","N4","A1","R2"]
[null,"Serie 9"]
["Tisch 1","S4","D2","K1","F3","T4","C2","L1","E3","P4","B2","M1","J3","R4","A2","N1","H3"]
["Tisch 2","S3","D1","K2","F4","T3","C1","L2","E4","P3","B1","M2","J4","R3","A1","N2","H4"]
["Tisch 3","S2","D4","K3","F1","T2","C4","L3","E1","P2","B4","M3","J1","R2","A4","N3","H1"]
["Tisch 4","S1","D3","K4","F2","T1","C3","L4","E2","P1","B3","M4","J2","R1","A3","N4","H2"]
["4. Spieltag","Serie 10"]
["Tisch 1","P1","N4","C2","F3","R1","M4","D2","E3","S1","L4","A2","J3","T1","K4","B2","H3"]
["Tisch 2","P2","N3","C1","F4","R2","M3","D1","E4","S2","L3","A1","J4","T2","K3","B1","H4"]
["Tisch 3","P3","N2","C4","F1","R3","M2","D4","E1","S3","L2","A4","J1","T3","K2","B4","H1"]
["Tisch 4","P4","N1","C3","F2","R4","M1","D3","E2","S4","L1","A3","J2","T4","K1","B3","H2"]
[null,"Serie 11"]
["Tisch 1","N2","P1","F4","C3","M2","R1","E4","D3","L2","S1","J4","A3","K2","T1","H4","B3"]
["Tisch 2","N1","P2","F3","C4","M1","R2","E3","D4","L1","S2","J3","A4","K1","T2","H3","B4"]
["Tisch 3","N4","P3","F2","C1","M4","R3","E2","D1","L4","S3","J2","A1","K4","T3","H2","B1"]
["Tisch 4","N3","P4","F1","C2","M3","R4","E1","D2","L3","S4","J1","A2","K3","T4","H1","B2"]
[null,"Serie 12"]
["Tisch 1","C4","F2","P1","N3","D4","E2","R1","M3","A4","J2","S1","L3","B4","H2","T1","K3"]
["Tisch 2","C3","F1","P2","N4","D3","E1","R2","M4","A3","J1","S2","L4","B3","H1","T2","K4"]
["Tisch 3","C2","F4","P3","N1","D2","E4","R3","M1","A2","J4","S3","L1","B2","H4","T3","K1"]
["Tisch 4","C1","F3","P4","N2","D1","E3","R4","M2","A1","J3","S4","L2","B1","H3","T4","K2"]
["5. Spieltag","Serie 13"]
["Tisch 1","A1","D4","B2","C3","E1","J4","F2","H3","K1","N4","L2","M3","P1","T4","R2","S3"]
["Tisch 2","A2","D3","B1","C4","E2","J3","F1","H4","K2","N3","L1","M4","P2","T3","R1","S4"]
["Tisch 3","A3","D2","B4","C1","E3","J2","F4","H1","K3","N2","L4","M1","P3","T2","R4","S1"]
["Tisch 4","A4","D1","B3","C2","E4","J1","F3","H2","K4","N1","L3","M2","P4","T1","R3","S2"]
[null,"Serie 14"]
["Tisch 1","D2","A1","C4","B3","J2","E1","H4","F3","N2","K1","M4","L3","T2","P1","S4","R3"]
["Tisch 2","D1","A2","C3","B4","J1","E2","H3","F4","N1","K2","M3","L4","T1","P2","S3","R4"]
["Tisch 3","D4","A3","C2","B1","J4","E3","H2","F1","N4","K3","M2","L1","T4","P3","S2","R1"]
["Tisch 4","D3","A4","C1","B2","J3","E4","H1","F2","N3","K4","M1","L2","T3","P4","S1","R2"]
[null,"Serie 15"]
["Tisch 1","B4","C2","A1","D3","F4","H2","E1","J3","L4","M2","K1","N3","R4","S2","P1","T3"]
["Tisch 2","B3","C1","A2","D4","F3","H1","E2","J4","L3","M1","K2","N4","R3","S1","P2","T4"]
["Tisch 3","B2","C4","A3","D1","F2","H4","E3","J1","L2","M4","K3","N1","R2","S4","P3","T1"]
["Tisch 4","B1","C3","A4","D2","F1","H3","E4","J2","L1","M3","K4","N2","R1","S3","P4","T2"]

{"sheet":"Gaststätte","index":5,"n_rows":780,"n_cols":17,"rows_kept":780,"cut":false,"hidden":false,"merged":[[0,1,0,3],[1,2,1,3],[1,11,1,12],[79,2,79,3],[79,11,79,12],[100,2,100,3],[100,11,100,12],[81,2,81,3],[81,11,81,12],[82,2,82,3],[82,11,82,12],[61,2,61,3],[61,11,61,12],[64,2,64,3],[64,11,64,12],[42,2,42,3],[42,11,42,12],[43,2,43,3],[43,11,43,12],[63,2,63,3],[63,11,63,12],[3,2,3,3],[4,2,4,3],[3,11,3,12],[4,11,4,12],[196,2,196,3],[196,11,196,12],[217,2,217,3],[217,11,217,12],[198,2,198,3],[198,11,198,12],[199,2,199,3],[199,11,199,12],[178,2,178,3],[178,11,178,12],[181,2,181,3],[181,11,181,12],[24,2,24,3],[25,2,25,3],[22,2,22,3],[22,11,22,12],[40,2,40,3],[40,11,40,12],[24,11,24,12],[25,11,25,12],[159,2,159,3],[159,11,159,12],[160,2,160,3],[313,2,313,3],[313,11,313,12],[334,2,334,3],[334,11,334,12],[315,2,315,3],[315,11,315,12],[316,2,316,3],[316,11,316,12],[295,2,295,3],[295,11,295,12],[298,2,298,3],[298,11,298,12],[430,2,430,3],[430,11,430,12],[451,2,451,3],[451,11,451,12],[432,2,432,3],[432,11,432,12],[433,2,433,3],[433,11,433,12],[412,2,412,3],[412,11,412,12],[415,2,415,3],[415,11,415,12],[547,2,547,3],[547,11,547,12],[568,2,568,3],[568,11,568,12],[549,2,549,3],[549,11,549,12],[550,2,550,3],[550,11,550,12],[529,2,529,3],[529,11,529,12],[532,2,532,3],[532,11,532,12],[664,2,664,3],[664,11,664,12],[685,2,685,3],[685,11,685,12],[666,2,666,3],[666,11,666,12],[667,2,667,3],[667,11,667,12],[646,2,646,3],[646,11,646,12],[649,2,649,3],[649,11,649,12],[766,2,766,3],[766,11,766,12],[724,2,724,3],[724,11,724,12],[742,2,742,3],[742,11,742,12],[726,2,726,3],[726,11,726,12],[727,2,727,3],[727,11,727,12],[744,2,744,3],[744,11,744,12],[745,2,745,3],[745,11,745,12],[765,2,765,3],[765,11,765,12],[160,11,160,12],[180,2,180,3],[180,11,180,12],[102,2,102,3],[102,11,102,12],[103,2,103,3],[103,11,103,12],[120,2,120,3],[120,11,120,12],[139,2,139,3],[139,11,139,12],[157,2,157,3],[157,11,157,12],[141,2,141,3],[141,11,141,12],[142,2,142,3],[142,11,142,12],[118,2,118,3],[118,11,118,12],[121,2,121,3],[121,11,121,12],[276,2,276,3],[276,11,276,12],[277,2,277,3],[277,11,277,12],[297,2,297,3],[297,11,297,12],[219,2,219,3],[219,11,219,12],[220,2,220,3],[220,11,220,12],[237,2,237,3],[237,11,237,12],[256,2,256,3],[256,11,256,12],[274,2,274,3],[274,11,274,12],[258,2,258,3],[258,11,258,12],[259,2,259,3],[259,11,259,12],[235,2,235,3],[235,11,235,12],[238,2,238,3],[238,11,238,12],[393,2,393,3],[393,11,393,12],[394,2,394,3],[394,11,394,12],[414,2,414,3],[414,11,414,12],[336,2,336,3],[336,11,336,12],[337,2,337,3],[337,11,337,12],[354,2,354,3],[354,11,354,12],[373,2,373,3],[373,11,373,12],[391,2,391,3],[391,11,391,12],[375,2,375,3],[375,11,375,12],[376,2,376,3],[376,11,376,12],[352,2,352,3],[352,11,352,12],[355,2,355,3],[355,11,355,12],[510,2,510,3],[510,11,510,12],[511,2,511,3],[511,11,511,12],[531,2,531,3],[531,11,531,12],[453,2,453,3],[453,11,453,12],[454,2,454,3],[454,11,454,12],[471,2,471,3],[471,11,471,12],[490,2,490,3],[490,11,490,12],[508,2,508,3],[508,11,508,12],[492,2,492,3],[492,11,492,12],[493,2,493,3],[493,11,493,12],[469,2,469,3],[469,11,469,12],[472,2,472,3],[472,11,472,12],[627,2,627,3],[627,11,627,12],[628,2,628,3],[628,11,628,12],[648,2,648,3],[648,11,648,12],[570,2,570,3],[570,11,570,12],[571,2,571,3],[571,11,571,12],[588,2,588,3],[588,11,588,12],[607,2,607,3],[607,11,607,12],[625,2,625,3],[625,11,625,12],[609,2,609,3],[609,11,609,12],[610,2,610,3],[610,11,610,12],[586,2,586,3],[586,11,586,12],[589,2,589,3],[589,11,589,12],[687,2,687,3],[687,11,687,12],[688,2,688,3],[688,11,688,12],[705,2,705,3],[705,11,705,12],[763,2,763,3],[763,11,763,12],[703,2,703,3],[703,11,703,12],[706,2,706,3],[706,11,706,12]]}
[null,"Thüringer Landesoberliga",null,null,"Start-Nr.",null,"A",1,null,null,{"$f":"B1","v":"Thüringer Landesoberliga"},null,null,{"$f":"E1","v":"Start-Nr."},null,{"$f":"G1","v":"A"},{"$f":"H1+1","v":2}]
[]
[]
[null,"Name:",null,null,null,null,null,null,null,null,{"$f":"B4","v":"Name:"}]
[null,"Vorname:",null,null,null,null,null,null,null,null,{"$f":"B5","v":"Vorname:"}]
[]
[]
[]
[]
[]
[]
[]
[]
[]
[]
[]
[null,"Diesen Verzehrzettel bei Veranstaltungsende bitte",null,null,null,null,null,null,null,null,{"$f":"B17","v":"Diesen Verzehrzettel bei Veranstaltungsende bitte"}]
[null," unbedingt abgeben, auch wenn nichts darauf steht.",null,null,null,null,null,null,null,null,{"$f":"B18","v":" unbedingt abgeben, auch wenn nichts darauf steht."}]
[]
[]
[]
[null,{"$f":"B1","v":"Thüringer Landesoberliga"},null,null,"Start-Nr.",null,{"$f":"G1","v":"A"},{"$f":"H1+2","v":3},null,null,{"$f":"B22","v":"Thüringer Landesoberliga"},null,null,{"$f":"E22","v":"Start-Nr."},null,{"$f":"P1","v":"A"},{"$f":"Q1+2","v":4}]
[]
[]
[null,{"$f":"B4","v":"Name:"},null,null,null,null,null,null,null,null,{"$f":"B25","v":"Name:"}]
[null,{"$f":"B5","v":"Vorname:"},null,null,null,null,null,null,null,null,{"$f":"B26","v":"Vorname:"}]
[]
[]
[]
[]
[]
[]
[]
[]
[]
[]
[]
[null,{"$f":"B17","v":"Diesen Verzehrzettel bei Veranstaltungsende bitte"},null,null,null,null,null,null,null,null,{"$f":"B38","v":"Diesen Verzehrzettel bei Veranstaltungsende bitte"}]
[null,{"$f":"B18","v":" unbedingt abgeben, auch wenn nichts darauf steht."},null,null,null,null,null,null,null,null,{"$f":"B39","v":" unbedingt abgeben, auch wenn nichts darauf steht."}]
[null,{"$f":"B1","v":"Thüringer Landesoberliga"},null,null,"Start-Nr.",null,"B",{"$f":"H1","v":1},null,null,{"$f":"B40","v":"Thüringer Landesoberliga"},null,null,{"$f":"E40","v":"Start-Nr."},null,{"$f":"G40","v":"B"},{"$f":"H40+1","v":2}]
[]
[]
[null,{"$f":"B4","v":"Name:"},null,null,null,null,null,null,null,null,{"$f":"B43","v":"Name:"}]
[null,{"$f":"B5","v":"Vorname:"},null,null,null,null,null,null,null,null,{"$f":"B44","v":"Vorname:"}]
[]
[]
[]
[]
[]
[]
[]
[]
[]
[]
[]
[null,{"$f":"B17","v":"Diesen Verzehrzettel bei Veranstaltungsende bitte"},null,null,null,null,null,null,null,null,{"$f":"B56","v":"Diesen Verzehrzettel bei Veranstaltungsende bitte"}]
[null,{"$f":"B18","v":" unbedingt abgeben, auch wenn nichts darauf steht."},null,null,null,null,null,null,null,null,{"$f":"B57","v":" unbedingt abgeben, auch wenn nichts darauf steht."}]
[]
[]
[]
[null,{"$f":"B40","v":"Thüringer Landesoberliga"},null,null,"Start-Nr.",null,{"$f":"G40","v":"B"},{"$f":"H40+2","v":3},null,null,{"$f":"B61","v":"Thüringer Landesoberliga"},null,null,{"$f":"E61","v":"Start-Nr."},null,{"$f":"P40","v":"B"},{"$f":"Q40+2","v":4}]
[]
[]
[null,{"$f":"B43","v":"Name:"},null,null,null,null,null,null,null,null,{"$f":"B64","v":"Name:"}]
[null,{"$f":"B44","v":"Vorname:"},null,null,null,null,null,null,null,null,{"$f":"B65","v":"Vorname:"}]
[]
[]
[]
[]
[]
[]
[]
[]
[]
[]
[]
[null,{"$f":"B56","v":"Diesen Verzehrzettel bei Veranstaltungsende bitte"},null,null,null,null,null,null,null,null,{"$f":"B77","v":"Diesen Verzehrzettel bei Veranstaltungsende bitte"}]
[null,{"$f":"B57","v":" unbedingt abgeben, auch wenn nichts darauf steht."},null,null,null,null,null,null,null,null,{"$f":"B78","v":" unbedingt abgeben, auch wenn nichts darauf steht."}]
[null,{"$f":"B40","v":"Thüringer Landesoberliga"},null,null,"Start-Nr.",null,"C",{"$f":"H40","v":1},null,null,{"$f":"B79","v":"Thüringer Landesoberliga"},null,null,{"$f":"E79","v":"Start-Nr."},null,{"$f":"G79","v":"C"},{"$f":"H79+1","v":2}]
[]
[]
[null,{"$f":"B43","v":"Name:"},null,null,null,null,null,null,null,null,{"$f":"B82","v":"Name:"}]
[null,{"$f":"B44","v":"Vorname:"},null,null,null,null,null,null,null,null,{"$f":"B83","v":"Vorname:"}]
[]
[]
[]
[]
[]
[]
[]
[]
[]
[]
[]
[null,{"$f":"B56","v":"Diesen Verzehrzettel bei Veranstaltungsende bitte"},null,null,null,null,null,null,null,null,{"$f":"B95","v":"Diesen Verzehrzettel bei Veranstaltungsende bitte"}]
[null,{"$f":"B57","v":" unbedingt abgeben, auch wenn nichts darauf steht."},null,null,null,null,null,null,null,null,{"$f":"B96","v":" unbedingt abgeben, auch wenn nichts darauf steht."}]
[]
[]
[]
[null,{"$f":"B79","v":"Thüringer Landesoberliga"},null,null,"Start-Nr.",null,{"$f":"G79","v":"C"},{"$f":"H79+2","v":3},null,null,{"$f":"B100","v":"Thüringer Landesoberliga"},null,null,{"$f":"E100","v":"Start-Nr."},null,{"$f":"P79","v":"C"},{"$f":"Q79+2","v":4}]
[]
[]
[null,{"$f":"B82","v":"Name:"},null,null,null,null,null,null,null,null,{"$f":"B103","v":"Name:"}]
[null,{"$f":"B83","v":"Vorname:"},null,null,null,null,null,null,null,null,{"$f":"B104","v":"Vorname:"}]
[]
[]
[]
[]
[]
[]
[]
[]
[]
[]
[]
[null,{"$f":"B95","v":"Diesen Verzehrzettel bei Veranstaltungsende bitte"},null,null,null,null,null,null,null,null,{"$f":"B116","v":"Diesen Verzehrzettel bei Veranstaltungsende bitte"}]
[null,{"$f":"B96","v":" unbedingt abgeben, auch wenn nichts darauf steht."},null,null,null,null,null,null,null,null,{"$f":"B117","v":" unbedingt abgeben, auch wenn nichts darauf steht."}]
[null,{"$f":"B79","v":"Thüringer Landesoberliga"},null,null,"Start-Nr.",null,"D",{"$f":"H79","v":1},null,null,{"$f":"B118","v":"Thüringer Landesoberliga"},null,null,{"$f":"E118","v":"Start-Nr."},null,{"$f":"G118","v":"D"},{"$f":"H118+1","v":2}]
[]
[]
[null,{"$f":"B82","v":"Name:"},null,null,null,null,null,null,null,null,{"$f":"B121","v":"Name:"}]
[null,{"$f":"B83","v":"Vorname:"},null,null,null,null,null,null,null,null,{"$f":"B122","v":"Vorname:"}]
[]
[]
[]
[]
[]
[]
[]
[]
[]
[]
[]
[null,{"$f":"B95","v":"Diesen Verzehrzettel bei Veranstaltungsende bitte"},null,null,null,null,null,null,null,null,{"$f":"B134","v":"Diesen Verzehrzettel bei Veranstaltungsende bitte"}]
[null,{"$f":"B96","v":" unbedingt abgeben, auch wenn nichts darauf steht."},null,null,null,null,null,null,null,null,{"$f":"B135","v":" unbedingt abgeben, auch wenn nichts darauf steht."}]
[]
[]
[]
[null,{"$f":"B118","v":"Thüringer Landesoberliga"},null,null,"Start-Nr.",null,{"$f":"G118","v":"D"},{"$f":"H118+2","v":3},null,null,{"$f":"B139","v":"Thüringer Landesoberliga"},null,null,{"$f":"E139","v":"Start-Nr."},null,{"$f":"P118","v":"D"},{"$f":"Q118+2","v":4}]
[]
[]
[null,{"$f":"B121","v":"Name:"},null,null,null,null,null,null,null,null,{"$f":"B142","v":"Name:"}]
[null,{"$f":"B122","v":"Vorname:"},null,null,null,null,null,null,null,null,{"$f":"B143","v":"Vorname:"}]
[]
[]
[]
[]
[]
[]
[]
[]
[]
[]
[]
[null,{"$f":"B134","v":"Diesen Verzehrzettel bei Veranstaltungsende bitte"},null,null,null,null,null,null,null,null,{"$f":"B155","v":"Diesen Verzehrzettel bei Veranstaltungsende bitte"}]
[null,{"$f":"B135","v":" unbedingt abgeben, auch wenn nichts darauf steht."},null,null,null,null,null,null,null,null,{"$f":"B156","v":" unbedingt abgeben, auch wenn nichts darauf steht."}]
[null,{"$f":"B118","v":"Thüringer Landesoberliga"},null,null,"Start-Nr.",null,"E",{"$f":"H118","v":1},null,null,{"$f":"B157","v":"Thüringer Landesoberliga"},null,null,{"$f":"E157","v":"Start-Nr."},null,{"$f":"G157","v":"E"},{"$f":"H157+1","v":2}]
[]
[]
[null,{"$f":"B121","v":"Name:"},null,null,null,null,null,null,null,null,{"$f":"B160","v":"Name:"}]
[null,{"$f":"B122","v":"Vorname:"},null,null,null,null,null,null,null,null,{"$f":"B161","v":"Vorname:"}]
[]
[]
[]
[]
[]
[]
[]
[]
[]
[]
[]
[null,{"$f":"B134","v":"Diesen Verzehrzettel bei Veranstaltungsende bitte"},null,null,null,null,null,null,null,null,{"$f":"B173","v":"Diesen Verzehrzettel bei Veranstaltungsende bitte"}]
[null,{"$f":"B135","v":" unbedingt abgeben, auch wenn nichts darauf steht."},null,null,null,null,null,null,null,null,{"$f":"B174","v":" unbedingt abgeben, auch wenn nichts darauf steht."}]
[]
[]
[]
[null,{"$f":"B157","v":"Thüringer Landesoberliga"},null,null,"Start-Nr.",null,{"$f":"G157","v":"E"},{"$f":"H157+2","v":3},null,null,{"$f":"B178","v":"Thüringer Landesoberliga"},null,null,{"$f":"E178","v":"Start-Nr."},null,{"$f":"P157","v":"E"},{"$f":"Q157+2","v":4}]
[]
[]
[null,{"$f":"B160","v":"Name:"},null,null,null,null,null,null,null,null,{"$f":"B181","v":"Name:"}]
[null,{"$f":"B161","v":"Vorname:"},null,null,null,null,null,null,null,null,{"$f":"B182","v":"Vorname:"}]
[]
[]
[]
[]
[]
[]
[]
[]
[]
[]
[]
[null,{"$f":"B173","v":"Diesen Verzehrzettel bei Veranstaltungsende bitte"},null,null,null,null,null,null,null,null,{"$f":"B194","v":"Diesen Verzehrzettel bei Veranstaltungsende bitte"}]
[null,{"$f":"B174","v":" unbedingt abgeben, auch wenn nichts darauf steht."},null,null,null,null,null,null,null,null,{"$f":"B195","v":" unbedingt abgeben, auch wenn nichts darauf steht."}]
[null,{"$f":"B157","v":"Thüringer Landesoberliga"},null,null,"Start-Nr.",null,"F",{"$f":"H157","v":1},null,null,{"$f":"B196","v":"Thüringer Landesoberliga"},null,null,{"$f":"E196","v":"Start-Nr."},null,{"$f":"G196","v":"F"},{"$f":"H196+1","v":2}]
[]
[]
[null,{"$f":"B160","v":"Name:"},null,null,null,null,null,null,null,null,{"$f":"B199","v":"Name:"}]
[null,{"$f":"B161","v":"Vorname:"},null,null,null,null,null,null,null,null,{"$f":"B200","v":"Vorname:"}]
[]
[]
[]
[]
[]
[]
[]
[]
[]
[]
[]
[null,{"$f":"B173","v":"Diesen Verzehrzettel bei Veranstaltungsende bitte"},null,null,null,null,null,null,null,null,{"$f":"B212","v":"Diesen Verzehrzettel bei Veranstaltungsende bitte"}]
[null,{"$f":"B174","v":" unbedingt abgeben, auch wenn nichts darauf steht."},null,null,null,null,null,null,null,null,{"$f":"B213","v":" unbedingt abgeben, auch wenn nichts darauf steht."}]
[]
[]
[]
[null,{"$f":"B196","v":"Thüringer Landesoberliga"},null,null,"Start-Nr.",null,{"$f":"G196","v":"F"},{"$f":"H196+2","v":3},null,null,{"$f":"B217","v":"Thüringer Landesoberliga"},null,null,{"$f":"E217","v":"Start-Nr."},null,{"$f":"P196","v":"F"},{"$f":"Q196+2","v":4}]
[]
[]
[null,{"$f":"B199","v":"Name:"},null,null,null,null,null,null,null,null,{"$f":"B220","v":"Name:"}]
[null,{"$f":"B200","v":"Vorname:"},null,null,null,null,null,null,null,null,{"$f":"B221","v":"Vorname:"}]
[]
[]
[]
[]
[]
[]
[]
[]
[]
[]
[]
[null,{"$f":"B212","v":"Diesen Verzehrzettel bei Veranstaltungsende bitte"},null,null,null,null,null,null,null,null,{"$f":"B233","v":"Diesen Verzehrzettel bei Veranstaltungsende bitte"}]
[null,{"$f":"B213","v":" unbedingt abgeben, auch wenn nichts darauf steht."},null,null,null,null,null,null,null,null,{"$f":"B234","v":" unbedingt abgeben, auch wenn nichts darauf steht."}]
[null,{"$f":"B196","v":"Thüringer Landesoberliga"},null,null,"Start-Nr.",null,"H",{"$f":"H196","v":1},null,null,{"$f":"B235","v":"Thüringer Landesoberliga"},null,null,{"$f":"E235","v":"Start-Nr."},null,{"$f":"G235","v":"H"},{"$f":"H235+1","v":2}]
[]
[]
[null,{"$f":"B199","v":"Name:"},null,null,null,null,null,null,null,null,{"$f":"B238","v":"Name:"}]
[null,{"$f":"B200","v":"Vorname:"},null,null,null,null,null,null,null,null,{"$f":"B239","v":"Vorname:"}]
[]
[]
[]
[]
[]
[]
[]
[]
[]
[]
[]
[null,{"$f":"B212","v":"Diesen Verzehrzettel bei Veranstaltungsende bitte"},null,null,null,null,null,null,null,null,{"$f":"B251","v":"Diesen Verzehrzettel bei Veranstaltungsende bitte"}]
[null,{"$f":"B213","v":" unbedingt abgeben, auch wenn nichts darauf steht."},null,null,null,null,null,null,null,null,{"$f":"B252","v":" unbedingt abgeben, auch wenn nichts darauf steht."}]
[]
[]
[]
[null,{"$f":"B235","v":"Thüringer Landesoberliga"},null,null,"Start-Nr.",null,{"$f":"G235","v":"H"},{"$f":"H235+2","v":3},null,null,{"$f":"B256","v":"Thüringer Landesoberliga"},null,null,{"$f":"E256","v":"Start-Nr."},null,{"$f":"P235","v":"H"},{"$f":"Q235+2","v":4}]
[]
[]
[null,{"$f":"B238","v":"Name:"},null,null,null,null,null,null,null,null,{"$f":"B259","v":"Name:"}]
[null,{"$f":"B239","v":"Vorname:"},null,null,null,null,null,null,null,null,{"$f":"B260","v":"Vorname:"}]
[]
[]
[]
[]
[]
[]
[]
[]
[]
[]
[]
[null,{"$f":"B251","v":"Diesen Verzehrzettel bei Veranstaltungsende bitte"},null,null,null,null,null,null,null,null,{"$f":"B272","v":"Diesen Verzehrzettel bei Veranstaltungsende bitte"}]
[null,{"$f":"B252","v":" unbedingt abgeben, auch wenn nichts darauf steht."},null,null,null,null,null,null,null,null,{"$f":"B273","v":" unbedingt abgeben, auch wenn nichts darauf steht."}]
[null,{"$f":"B235","v":"Thüringer Landesoberliga"},null,null,"Start-Nr.",null,"J",{"$f":"H235","v":1},null,null,{"$f":"B274","v":"Thüringer Landesoberliga"},null,null,{"$f":"E274","v":"Start-Nr."},null,{"$f":"G274","v":"J"},{"$f":"H274+1","v":2}]
[]
[]
[null,{"$f":"B238","v":"Name:"},null,null,null,null,null,null,null,null,{"$f":"B277","v":"Name:"}]
[null,{"$f":"B239","v":"Vorname:"},null,null,null,null,null,null,null,null,{"$f":"B278","v":"Vorname:"}]
[]
[]
[]
[]
[]
[]
[]
[]
[]
[]
[]
[null,{"$f":"B251","v":"Diesen Verzehrzettel bei Veranstaltungsende bitte"},null,null,null,null,null,null,null,null,{"$f":"B290","v":"Diesen Verzehrzettel bei Veranstaltungsende bitte"}]
[null,{"$f":"B252","v":" unbedingt abgeben, auch wenn nichts darauf steht."},null,null,null,null,null,null,null,null,{"$f":"B291","v":" unbedingt abgeben, auch wenn nichts darauf steht."}]
[]
[]
[]
[null,{"$f":"B274","v":"Thüringer Landesoberliga"},null,null,"Start-Nr.",null,{"$f":"G274","v":"J"},{"$f":"H274+2","v":3},null,null,{"$f":"B295","v":"Thüringer Landesoberliga"},null,null,{"$f":"E295","v":"Start-Nr."},null,{"$f":"P274","v":"J"},{"$f":"Q274+2","v":4}]
[]
[]
[null,{"$f":"B277","v":"Name:"},null,null,null,null,null,null,null,null,{"$f":"B298","v":"Name:"}]
[null,{"$f":"B278","v":"Vorname:"},null,null,null,null,null,null,null,null,{"$f":"B299","v":"Vorname:"}]
[]
[]
[]
[]
[]
[]
[]
[]
[]
[]
[]
[null,{"$f":"B290","v":"Diesen Verzehrzettel bei Veranstaltungsende bitte"},null,null,null,null,null,null,null,null,{"$f":"B311","v":"Diesen Verzehrzettel bei Veranstaltungsende bitte"}]
[null,{"$f":"B291","v":" unbedingt abgeben, auch wenn nichts darauf steht."},null,null,null,null,null,null,null,null,{"$f":"B312","v":" unbedingt abgeben, auch wenn nichts darauf steht."}]
[null,{"$f":"B274","v":"Thüringer Landesoberliga"},null,null,"Start-Nr.",null,"K",{"$f":"H274","v":1},null,null,{"$f":"B313","v":"Thüringer Landesoberliga"},null,null,{"$f":"E313","v":"Start-Nr."},null,{"$f":"G313","v":"K"},{"$f":"H313+1","v":2}]
[]
[]
[null,{"$f":"B277","v":"Name:"},null,null,null,null,null,null,null,null,{"$f":"B316","v":"Name:"}]
[null,{"$f":"B278","v":"Vorname:"},null,null,null,null,null,null,null,null,{"$f":"B317","v":"Vorname:"}]
[]
[]
[]
[]
[]
[]
[]
[]
[]
[]
[]
[null,{"$f":"B290","v":"Diesen Verzehrzettel bei Veranstaltungsende bitte"},null,null,null,null,null,null,null,null,{"$f":"B329","v":"Diesen Verzehrzettel bei Veranstaltungsende bitte"}]
[null,{"$f":"B291","v":" unbedingt abgeben, auch wenn nichts darauf steht."},null,null,null,null,null,null,null,null,{"$f":"B330","v":" unbedingt abgeben, auch wenn nichts darauf steht."}]
[]
[]
[]
[null,{"$f":"B313","v":"Thüringer Landesoberliga"},null,null,"Start-Nr.",null,{"$f":"G313","v":"K"},{"$f":"H313+2","v":3},null,null,{"$f":"B334","v":"Thüringer Landesoberliga"},null,null,{"$f":"E334","v":"Start-Nr."},null,{"$f":"P313","v":"K"},{"$f":"Q313+2","v":4}]
[]
[]
[null,{"$f":"B316","v":"Name:"},null,null,null,null,null,null,null,null,{"$f":"B337","v":"Name:"}]
[null,{"$f":"B317","v":"Vorname:"},null,null,null,null,null,null,null,null,{"$f":"B338","v":"Vorname:"}]
[]
[]
[]
[]
[]
[]
[]
[]
[]
[]
[]
[null,{"$f":"B329","v":"Diesen Verzehrzettel bei Veranstaltungsende bitte"},null,null,null,null,null,null,null,null,{"$f":"B350","v":"Diesen Verzehrzettel bei Veranstaltungsende bitte"}]
[null,{"$f":"B330","v":" unbedingt abgeben, auch wenn nichts darauf steht."},null,null,null,null,null,null,null,null,{"$f":"B351","v":" unbedingt abgeben, auch wenn nichts darauf steht."}]
[null,{"$f":"B313","v":"Thüringer Landesoberliga"},null,null,"Start-Nr.",null,"L",{"$f":"H313","v":1},null,null,{"$f":"B352","v":"Thüringer Landesoberliga"},null,null,{"$f":"E352","v":"Start-Nr."},null,{"$f":"G352","v":"L"},{"$f":"H352+1","v":2}]
[]
[]
[null,{"$f":"B316","v":"Name:"},null,null,null,null,null,null,null,null,{"$f":"B355","v":"Name:"}]
[null,{"$f":"B317","v":"Vorname:"},null,null,null,null,null,null,null,null,{"$f":"B356","v":"Vorname:"}]
[]
[]
[]
[]
[]
[]
[]
[]
[]
[]
[]
[null,{"$f":"B329","v":"Diesen Verzehrzettel bei Veranstaltungsende bitte"},null,null,null,null,null,null,null,null,{"$f":"B368","v":"Diesen Verzehrzettel bei Veranstaltungsende bitte"}]
[null,{"$f":"B330","v":" unbedingt abgeben, auch wenn nichts darauf steht."},null,null,null,null,null,null,null,null,{"$f":"B369","v":" unbedingt abgeben, auch wenn nichts darauf steht."}]
[]
[]
[]
[null,{"$f":"B352","v":"Thüringer Landesoberliga"},null,null,"Start-Nr.",null,{"$f":"G352","v":"L"},{"$f":"H352+2","v":3},null,null,{"$f":"B373","v":"Thüringer Landesoberliga"},null,null,{"$f":"E373","v":"Start-Nr."},null,{"$f":"P352","v":"L"},{"$f":"Q352+2","v":4}]
[]
[]
[null,{"$f":"B355","v":"Name:"},null,null,null,null,null,null,null,null,{"$f":"B376","v":"Name:"}]
[null,{"$f":"B356","v":"Vorname:"},null,null,null,null,null,null,null,null,{"$f":"B377","v":"Vorname:"}]
[]
[]
[]
[]
[]
[]
[]
[]
[]
[]
[]
[null,{"$f":"B368","v":"Diesen Verzehrzettel bei Veranstaltungsende bitte"},null,null,null,null,null,null,null,null,{"$f":"B389","v":"Diesen Verzehrzettel bei Veranstaltungsende bitte"}]
[null,{"$f":"B369","v":" unbedingt abgeben, auch wenn nichts darauf steht."},null,null,null,null,null,null,null,null,{"$f":"B390","v":" unbedingt abgeben, auch wenn nichts darauf steht."}]
[null,{"$f":"B352","v":"Thüringer Landesoberliga"},null,null,"Start-Nr.",null,"M",{"$f":"H352","v":1},null,null,{"$f":"B391","v":"Thüringer Landesoberliga"},null,null,{"$f":"E391","v":"Start-Nr."},null,{"$f":"G391","v":"M"},{"$f":"H391+1","v":2}]
[]
[]
[null,{"$f":"B355","v":"Name:"},null,null,null,null,null,null,null,null,{"$f":"B394","v":"Name:"}]
[null,{"$f":"B356","v":"Vorname:"},null,null,null,null,null,null,null,null,{"$f":"B395","v":"Vorname:"}]
[]
[]
[]
[]
[]
[]
[]
[]
[]
[]
[]
[null,{"$f":"B368","v":"Diesen Verzehrzettel bei Veranstaltungsende bitte"},null,null,null,null,null,null,null,null,{"$f":"B407","v":"Diesen Verzehrzettel bei Veranstaltungsende bitte"}]
[null,{"$f":"B369","v":" unbedingt abgeben, auch wenn nichts darauf steht."},null,null,null,null,null,null,null,null,{"$f":"B408","v":" unbedingt abgeben, auch wenn nichts darauf steht."}]
[]
[]
[]
[null,{"$f":"B391","v":"Thüringer Landesoberliga"},null,null,"Start-Nr.",null,{"$f":"G391","v":"M"},{"$f":"H391+2","v":3},null,null,{"$f":"B412","v":"Thüringer Landesoberliga"},null,null,{"$f":"E412","v":"Start-Nr."},null,{"$f":"P391","v":"M"},{"$f":"Q391+2","v":4}]
[]
[]
[null,{"$f":"B394","v":"Name:"},null,null,null,null,null,null,null,null,{"$f":"B415","v":"Name:"}]
[null,{"$f":"B395","v":"Vorname:"},null,null,null,null,null,null,null,null,{"$f":"B416","v":"Vorname:"}]
[]
[]
[]
[]
[]
[]
[]
[]
[]
[]
[]
[null,{"$f":"B407","v":"Diesen Verzehrzettel bei Veranstaltungsende bitte"},null,null,null,null,null,null,null,null,{"$f":"B428","v":"Diesen Verzehrzettel bei Veranstaltungsende bitte"}]
[null,{"$f":"B408","v":" unbedingt abgeben, auch wenn nichts darauf steht."},null,null,null,null,null,null,null,null,{"$f":"B429","v":" unbedingt abgeben, auch wenn nichts darauf steht."}]
[null,{"$f":"B391","v":"Thüringer Landesoberliga"},null,null,"Start-Nr.",null,"N",{"$f":"H391","v":1},null,null,{"$f":"B430","v":"Thüringer Landesoberliga"},null,null,{"$f":"E430","v":"Start-Nr."},null,{"$f":"G430","v":"N"},{"$f":"H430+1","v":2}]
[]
[]
[null,{"$f":"B394","v":"Name:"},null,null,null,null,null,null,null,null,{"$f":"B433","v":"Name:"}]
[null,{"$f":"B395","v":"Vorname:"},null,null,null,null,null,null,null,null,{"$f":"B434","v":"Vorname:"}]
[]
[]
[]
[]
[]
[]
[]
[]
[]
[]
[]
[null,{"$f":"B407","v":"Diesen Verzehrzettel bei Veranstaltungsende bitte"},null,null,null,null,null,null,null,null,{"$f":"B446","v":"Diesen Verzehrzettel bei Veranstaltungsende bitte"}]
[null,{"$f":"B408","v":" unbedingt abgeben, auch wenn nichts darauf steht."},null,null,null,null,null,null,null,null,{"$f":"B447","v":" unbedingt abgeben, auch wenn nichts darauf steht."}]
[]
[]
[]
[null,{"$f":"B430","v":"Thüringer Landesoberliga"},null,null,"Start-Nr.",null,{"$f":"G430","v":"N"},{"$f":"H430+2","v":3},null,null,{"$f":"B451","v":"Thüringer Landesoberliga"},null,null,{"$f":"E451","v":"Start-Nr."},null,{"$f":"P430","v":"N"},{"$f":"Q430+2","v":4}]
[]
[]
[null,{"$f":"B433","v":"Name:"},null,null,null,null,null,null,null,null,{"$f":"B454","v":"Name:"}]
[null,{"$f":"B434","v":"Vorname:"},null,null,null,null,null,null,null,null,{"$f":"B455","v":"Vorname:"}]
[]
[]
[]
[]
[]
[]
[]
[]
[]
[]
[]
[null,{"$f":"B446","v":"Diesen Verzehrzettel bei Veranstaltungsende bitte"},null,null,null,null,null,null,null,null,{"$f":"B467","v":"Diesen Verzehrzettel bei Veranstaltungsende bitte"}]
[null,{"$f":"B447","v":" unbedingt abgeben, auch wenn nichts darauf steht."},null,null,null,null,null,null,null,null,{"$f":"B468","v":" unbedingt abgeben, auch wenn nichts darauf steht."}]
[null,{"$f":"B430","v":"Thüringer Landesoberliga"},null,null,"Start-Nr.",null,"P",{"$f":"H430","v":1},null,null,{"$f":"B469","v":"Thüringer Landesoberliga"},null,null,{"$f":"E469","v":"Start-Nr."},null,{"$f":"G469","v":"P"},{"$f":"H469+1","v":2}]
[]
[]
[null,{"$f":"B433","v":"Name:"},null,null,null,null,null,null,null,null,{"$f":"B472","v":"Name:"}]
[null,{"$f":"B434","v":"Vorname:"},null,null,null,null,null,null,null,null,{"$f":"B473","v":"Vorname:"}]
[]
[]
[]
[]
[]
[]
[]
[]
[]
[]
[]
[null,{"$f":"B446","v":"Diesen Verzehrzettel bei Veranstaltungsende bitte"},null,null,null,null,null,null,null,null,{"$f":"B485","v":"Diesen Verzehrzettel bei Veranstaltungsende bitte"}]
[null,{"$f":"B447","v":" unbedingt abgeben, auch wenn nichts darauf steht."},null,null,null,null,null,null,null,null,{"$f":"B486","v":" unbedingt abgeben, auch wenn nichts darauf steht."}]
[]
[]
[]
[null,{"$f":"B469","v":"Thüringer Landesoberliga"},null,null,"Start-Nr.",null,{"$f":"G469","v":"P"},{"$f":"H469+2","v":3},null,null,{"$f":"B490","v":"Thüringer Landesoberliga"},null,null,{"$f":"E490","v":"Start-Nr."},null,{"$f":"P469","v":"P"},{"$f":"Q469+2","v":4}]
[]
[]
[null,{"$f":"B472","v":"Name:"},null,null,null,null,null,null,null,null,{"$f":"B493","v":"Name:"}]
[null,{"$f":"B473","v":"Vorname:"},null,null,null,null,null,null,null,null,{"$f":"B494","v":"Vorname:"}]
[]
[]
[]
[]
[]
[]
[]
[]
[]
[]
[]
[null,{"$f":"B485","v":"Diesen Verzehrzettel bei Veranstaltungsende bitte"},null,null,null,null,null,null,null,null,{"$f":"B506","v":"Diesen Verzehrzettel bei Veranstaltungsende bitte"}]
[null,{"$f":"B486","v":" unbedingt abgeben, auch wenn nichts darauf steht."},null,null,null,null,null,null,null,null,{"$f":"B507","v":" unbedingt abgeben, auch wenn nichts darauf steht."}]
[null,{"$f":"B469","v":"Thüringer Landesoberliga"},null,null,"Start-Nr.",null,"R",{"$f":"H469","v":1},null,null,{"$f":"B508","v":"Thüringer Landesoberliga"},null,null,{"$f":"E508","v":"Start-Nr."},null,{"$f":"G508","v":"R"},{"$f":"H508+1","v":2}]
[]
[]
[null,{"$f":"B472","v":"Name:"},null,null,null,null,null,null,null,null,{"$f":"B511","v":"Name:"}]
[null,{"$f":"B473","v":"Vorname:"},null,null,null,null,null,null,null,null,{"$f":"B512","v":"Vorname:"}]
[]
[]
[]
[]
[]
[]
[]
[]
[]
[]
[]
[null,{"$f":"B485","v":"Diesen Verzehrzettel bei Veranstaltungsende bitte"},null,null,null,null,null,null,null,null,{"$f":"B524","v":"Diesen Verzehrzettel bei Veranstaltungsende bitte"}]
[null,{"$f":"B486","v":" unbedingt abgeben, auch wenn nichts darauf steht."},null,null,null,null,null,null,null,null,{"$f":"B525","v":" unbedingt abgeben, auch wenn nichts darauf steht."}]
[]
[]
[]
[null,{"$f":"B508","v":"Thüringer Landesoberliga"},null,null,"Start-Nr.",null,{"$f":"G508","v":"R"},{"$f":"H508+2","v":3},null,null,{"$f":"B529","v":"Thüringer Landesoberliga"},null,null,{"$f":"E529","v":"Start-Nr."},null,{"$f":"P508","v":"R"},{"$f":"Q508+2","v":4}]
[]
[]
[null,{"$f":"B511","v":"Name:"},null,null,null,null,null,null,null,null,{"$f":"B532","v":"Name:"}]
[null,{"$f":"B512","v":"Vorname:"},null,null,null,null,null,null,null,null,{"$f":"B533","v":"Vorname:"}]
[]
[]
[]
[]
[]
[]
[]
[]
[]
[]
[]
[null,{"$f":"B524","v":"Diesen Verzehrzettel bei Veranstaltungsende bitte"},null,null,null,null,null,null,null,null,{"$f":"B545","v":"Diesen Verzehrzettel bei Veranstaltungsende bitte"}]
[null,{"$f":"B525","v":" unbedingt abgeben, auch wenn nichts darauf steht."},null,null,null,null,null,null,null,null,{"$f":"B546","v":" unbedingt abgeben, auch wenn nichts darauf steht."}]
[null,{"$f":"B508","v":"Thüringer Landesoberliga"},null,null,"Start-Nr.",null,"S",{"$f":"H508","v":1},null,null,{"$f":"B547","v":"Thüringer Landesoberliga"},null,null,{"$f":"E547","v":"Start-Nr."},null,{"$f":"G547","v":"S"},{"$f":"H547+1","v":2}]
[]
[]
[null,{"$f":"B511","v":"Name:"},null,null,null,null,null,null,null,null,{"$f":"B550","v":"Name:"}]
[null,{"$f":"B512","v":"Vorname:"},null,null,null,null,null,null,null,null,{"$f":"B551","v":"Vorname:"}]
[]
[]
[]
[]
[]
[]
[]
[]
[]
[]
[]
[null,{"$f":"B524","v":"Diesen Verzehrzettel bei Veranstaltungsende bitte"},null,null,null,null,null,null,null,null,{"$f":"B563","v":"Diesen Verzehrzettel bei Veranstaltungsende bitte"}]
[null,{"$f":"B525","v":" unbedingt abgeben, auch wenn nichts darauf steht."},null,null,null,null,null,null,null,null,{"$f":"B564","v":" unbedingt abgeben, auch wenn nichts darauf steht."}]
[]
[]
[]
[null,{"$f":"B547","v":"Thüringer Landesoberliga"},null,null,"Start-Nr.",null,{"$f":"G547","v":"S"},{"$f":"H547+2","v":3},null,null,{"$f":"B568","v":"Thüringer Landesoberliga"},null,null,{"$f":"E568","v":"Start-Nr."},null,{"$f":"P547","v":"S"},{"$f":"Q547+2","v":4}]
[]
[]
[null,{"$f":"B550","v":"Name:"},null,null,null,null,null,null,null,null,{"$f":"B571","v":"Name:"}]
[null,{"$f":"B551","v":"Vorname:"},null,null,null,null,null,null,null,null,{"$f":"B572","v":"Vorname:"}]
[]
[]
[]
[]
[]
[]
[]
[]
[]
[]
[]
[null,{"$f":"B563","v":"Diesen Verzehrzettel bei Veranstaltungsende bitte"},null,null,null,null,null,null,null,null,{"$f":"B584","v":"Diesen Verzehrzettel bei Veranstaltungsende bitte"}]
[null,{"$f":"B564","v":" unbedingt abgeben, auch wenn nichts darauf steht."},null,null,null,null,null,null,null,null,{"$f":"B585","v":" unbedingt abgeben, auch wenn nichts darauf steht."}]
[null,{"$f":"B547","v":"Thüringer Landesoberliga"},null,null,"Start-Nr.",null,"T",{"$f":"H547","v":1},null,null,{"$f":"B586","v":"Thüringer Landesoberliga"},null,null,{"$f":"E586","v":"Start-Nr."},null,{"$f":"G586","v":"T"},{"$f":"H586+1","v":2}]
[]
[]
[null,{"$f":"B550","v":"Name:"},null,null,null,null,null,null,null,null,{"$f":"B589","v":"Name:"}]
[null,{"$f":"B551","v":"Vorname:"},null,null,null,null,null,null,null,null,{"$f":"B590","v":"Vorname:"}]
[]
[]
[]
[]
[]
[]
[]
[]
[]
[]
[]
[null,{"$f":"B563","v":"Diesen Verzehrzettel bei Veranstaltungsende bitte"},null,null,null,null,null,null,null,null,{"$f":"B602","v":"Diesen Verzehrzettel bei Veranstaltungsende bitte"}]
[null,{"$f":"B564","v":" unbedingt abgeben, auch wenn nichts darauf steht."},null,null,null,null,null,null,null,null,{"$f":"B603","v":" unbedingt abgeben, auch wenn nichts darauf steht."}]
[]
[]
[]
[null,{"$f":"B586","v":"Thüringer Landesoberliga"},null,null,"Start-Nr.",null,{"$f":"G586","v":"T"},{"$f":"H586+2","v":3},null,null,{"$f":"B607","v":"Thüringer Landesoberliga"},null,null,{"$f":"E607","v":"Start-Nr."},null,{"$f":"P586","v":"T"},{"$f":"Q586+2","v":4}]
[]
[]
[null,{"$f":"B589","v":"Name:"},null,null,null,null,null,null,null,null,{"$f":"B610","v":"Name:"}]
[null,{"$f":"B590","v":"Vorname:"},null,null,null,null,null,null,null,null,{"$f":"B611","v":"Vorname:"}]
[]
[]
[]
[]
[]
[]
[]
[]
[]
[]
[]
[null,{"$f":"B602","v":"Diesen Verzehrzettel bei Veranstaltungsende bitte"},null,null,null,null,null,null,null,null,{"$f":"B623","v":"Diesen Verzehrzettel bei Veranstaltungsende bitte"}]
[null,{"$f":"B603","v":" unbedingt abgeben, auch wenn nichts darauf steht."},null,null,null,null,null,null,null,null,{"$f":"B624","v":" unbedingt abgeben, auch wenn nichts darauf steht."}]
[null,{"$f":"B586","v":"Thüringer Landesoberliga"},null,null,"Start-Nr.",null,"A",5,null,null,{"$f":"B625","v":"Thüringer Landesoberliga"},null,null,{"$f":"E625","v":"Start-Nr."},null,"B",{"$f":"H625","v":5}]
[]
[]
[null,{"$f":"B589","v":"Name:"},null,null,null,null,null,null,null,null,{"$f":"B628","v":"Name:"}]
[null,{"$f":"B590","v":"Vorname:"},null,null,null,null,null,null,null,null,{"$f":"B629","v":"Vorname:"}]
[]
[]
[]
[]
[]
[]
[]
[]
[]
[]
[]
[null,{"$f":"B602","v":"Diesen Verzehrzettel bei Veranstaltungsende bitte"},null,null,null,null,null,null,null,null,{"$f":"B641","v":"Diesen Verzehrzettel bei Veranstaltungsende bitte"}]
[null,{"$f":"B603","v":" unbedingt abgeben, auch wenn nichts darauf steht."},null,null,null,null,null,null,null,null,{"$f":"B642","v":" unbedingt abgeben, auch wenn nichts darauf steht."}]
[]
[]
[]
[null,{"$f":"B625","v":"Thüringer Landesoberliga"},null,null,"Start-Nr.",null,"C",{"$f":"H625","v":5},null,null,{"$f":"B646","v":"Thüringer Landesoberliga"},null,null,{"$f":"E646","v":"Start-Nr."},null,"D",{"$f":"Q625","v":5}]
[]
[]
[null,{"$f":"B628","v":"Name:"},null,null,null,null,null,null,null,null,{"$f":"B649","v":"Name:"}]
[null,{"$f":"B629","v":"Vorname:"},null,null,null,null,null,null,null,null,{"$f":"B650","v":"Vorname:"}]
[]
[]
[]
[]
[]
[]
[]
[]
[]
[]
[]
[null,{"$f":"B641","v":"Diesen Verzehrzettel bei Veranstaltungsende bitte"},null,null,null,null,null,null,null,null,{"$f":"B662","v":"Diesen Verzehrzettel bei Veranstaltungsende bitte"}]
[null,{"$f":"B642","v":" unbedingt abgeben, auch wenn nichts darauf steht."},null,null,null,null,null,null,null,null,{"$f":"B663","v":" unbedingt abgeben, auch wenn nichts darauf steht."}]
[null,{"$f":"B625","v":"Thüringer Landesoberliga"},null,null,"Start-Nr.",null,"E",5,null,null,{"$f":"B664","v":"Thüringer Landesoberliga"},null,null,{"$f":"E664","v":"Start-Nr."},null,"F",{"$f":"H664","v":5}]
[]
[]
[null,{"$f":"B628","v":"Name:"},null,null,null,null,null,null,null,null,{"$f":"B667","v":"Name:"}]
[null,{"$f":"B629","v":"Vorname:"},null,null,null,null,null,null,null,null,{"$f":"B668","v":"Vorname:"}]
[]
[]
[]
[]
[]
[]
[]
[]
[]
[]
[]
[null,{"$f":"B641","v":"Diesen Verzehrzettel bei Veranstaltungsende bitte"},null,null,null,null,null,null,null,null,{"$f":"B680","v":"Diesen Verzehrzettel bei Veranstaltungsende bitte"}]
[null,{"$f":"B642","v":" unbedingt abgeben, auch wenn nichts darauf steht."},null,null,null,null,null,null,null,null,{"$f":"B681","v":" unbedingt abgeben, auch wenn nichts darauf steht."}]
[]
[]
[]
[null,{"$f":"B664","v":"Thüringer Landesoberliga"},null,null,"Start-Nr.",null,"H",{"$f":"H664","v":5},null,null,{"$f":"B685","v":"Thüringer Landesoberliga"},null,null,{"$f":"E685","v":"Start-Nr."},null,"J",{"$f":"Q664","v":5}]
[]
[]
[null,{"$f":"B667","v":"Name:"},null,null,null,null,null,null,null,null,{"$f":"B688","v":"Name:"}]
[null,{"$f":"B668","v":"Vorname:"},null,null,null,null,null,null,null,null,{"$f":"B689","v":"Vorname:"}]
[]
[]
[]
[]
[]
[]
[]
[]
[]
[]
[]
[null,{"$f":"B680","v":"Diesen Verzehrzettel bei Veranstaltungsende bitte"},null,null,null,null,null,null,null,null,{"$f":"B701","v":"Diesen Verzehrzettel bei Veranstaltungsende bitte"}]
[null,{"$f":"B681","v":" unbedingt abgeben, auch wenn nichts darauf steht."},null,null,null,null,null,null,null,null,{"$f":"B702","v":" unbedingt abgeben, auch wenn nichts darauf steht."}]
[null,{"$f":"B664","v":"Thüringer Landesoberliga"},null,null,"Start-Nr.",null,"K",5,null,null,{"$f":"B703","v":"Thüringer Landesoberliga"},null,null,{"$f":"E703","v":"Start-Nr."},null,"L",{"$f":"H703","v":5}]
[]
[]
[null,{"$f":"B667","v":"Name:"},null,null,null,null,null,null,null,null,{"$f":"B706","v":"Name:"}]
[null,{"$f":"B668","v":"Vorname:"},null,null,null,null,null,null,null,null,{"$f":"B707","v":"Vorname:"}]
[]
[]
[]
[]
[]
[]
[]
[]
[]
[]
[]
[null,{"$f":"B680","v":"Diesen Verzehrzettel bei Veranstaltungsende bitte"},null,null,null,null,null,null,null,null,{"$f":"B719","v":"Diesen Verzehrzettel bei Veranstaltungsende bitte"}]
[null,{"$f":"B681","v":" unbedingt abgeben, auch wenn nichts darauf steht."},null,null,null,null,null,null,null,null,{"$f":"B720","v":" unbedingt abgeben, auch wenn nichts darauf steht."}]
[]
[]
[]
[null,{"$f":"B703","v":"Thüringer Landesoberliga"},null,null,"Start-Nr.",null,"M",{"$f":"H703","v":5},null,null,{"$f":"B724","v":"Thüringer Landesoberliga"},null,null,{"$f":"E724","v":"Start-Nr."},null,"N",{"$f":"Q703","v":5}]
[]
[]
[null,{"$f":"B706","v":"Name:"},null,null,null,null,null,null,null,null,{"$f":"B727","v":"Name:"}]
[null,{"$f":"B707","v":"Vorname:"},null,null,null,null,null,null,null,null,{"$f":"B728","v":"Vorname:"}]
[]
[]
[]
[]
[]
[]
[]
[]
[]
[]
[]
[null,{"$f":"B719","v":"Diesen Verzehrzettel bei Veranstaltungsende bitte"},null,null,null,null,null,null,null,null,{"$f":"B740","v":"Diesen Verzehrzettel bei Veranstaltungsende bitte"}]
[null,{"$f":"B720","v":" unbedingt abgeben, auch wenn nichts darauf steht."},null,null,null,null,null,null,null,null,{"$f":"B741","v":" unbedingt abgeben, auch wenn nichts darauf steht."}]
[null,{"$f":"B703","v":"Thüringer Landesoberliga"},null,null,"Start-Nr.",null,"P",5,null,null,{"$f":"B742","v":"Thüringer Landesoberliga"},null,null,{"$f":"E742","v":"Start-Nr."},null,"R",{"$f":"H742","v":5}]
[]
[]
[null,{"$f":"B706","v":"Name:"},null,null,null,null,null,null,null,null,{"$f":"B745","v":"Name:"}]
[null,{"$f":"B707","v":"Vorname:"},null,null,null,null,null,null,null,null,{"$f":"B746","v":"Vorname:"}]
[]
[]
[]
[]
[]
[]
[]
[]
[]
[]
[]
[null,{"$f":"B719","v":"Diesen Verzehrzettel bei Veranstaltungsende bitte"},null,null,null,null,null,null,null,null,{"$f":"B758","v":"Diesen Verzehrzettel bei Veranstaltungsende bitte"}]
[null,{"$f":"B720","v":" unbedingt abgeben, auch wenn nichts darauf steht."},null,null,null,null,null,null,null,null,{"$f":"B759","v":" unbedingt abgeben, auch wenn nichts darauf steht."}]
[]
[]
[]
[null,{"$f":"B742","v":"Thüringer Landesoberliga"},null,null,"Start-Nr.",null,"S",{"$f":"H742","v":5},null,null,{"$f":"B763","v":"Thüringer Landesoberliga"},null,null,{"$f":"E763","v":"Start-Nr."},null,"T",{"$f":"Q742","v":5}]
[]
[]
[null,{"$f":"B745","v":"Name:"},null,null,null,null,null,null,null,null,{"$f":"B766","v":"Name:"}]
[null,{"$f":"B746","v":"Vorname:"},null,null,null,null,null,null,null,null,{"$f":"B767","v":"Vorname:"}]
[]
[]
[]
[]
[]
[]
[]
[]
[]
[]
[]
[null,{"$f":"B758","v":"Diesen Verzehrzettel bei Veranstaltungsende bitte"},null,null,null,null,null,null,null,null,{"$f":"B779","v":"Diesen Verzehrzettel bei Veranstaltungsende bitte"}]
[null,{"$f":"B759","v":" unbedingt abgeben, auch wenn nichts darauf steht."},null,null,null,null,null,null,null,null,{"$f":"B780","v":" unbedingt abgeben, auch wenn nichts darauf steht."}]

{"sheet":"Liste","index":6,"n_rows":43,"n_cols":8,"rows_kept":43,"cut":false,"hidden":false,"merged":[[0,0,0,3]]}
[{"$f":"Gaststätte!B1","v":"Thüringer Landesoberliga"},null,null,null," - Ausgabeliste -"]
[]
["Mannschaft",null,"Ausgabe","abgegeben","Mannschaft",null,"Ausgabe","abgegeben"]
["A",1,"ü",null,"K",1,"ü"]
[null,2,"ü",null,null,2,"ü"]
[null,3,"ü",null,null,3,"ü"]
[null,4,"ü",null,null,4,"ü"]
[null,5,null,null,null,5]
["B",1,"ü",null,"L",1,"ü"]
[null,2,"ü",null,null,2,"ü"]
[null,3,"ü",null,null,3,"ü"]
[null,4,"ü",null,null,4,"ü"]
[null,5,null,null,null,5]
["C",1,"ü",null,"M",1,"ü"]
[null,2,"ü",null,null,2,"ü"]
[null,3,"ü",null,null,3,"ü"]
[null,4,"ü",null,null,4,"ü"]
[null,5,null,null,null,5]
["D",1,"ü",null,"N",1,"ü"]
[null,2,"ü",null,null,2,"ü"]
[null,3,"ü",null,null,3,"ü"]
[null,4,"ü",null,null,4,"ü"]
[null,5,null,null,null,5]
["E",1,"ü",null,"P",1,"ü"]
[null,2,"ü",null,null,2,"ü"]
[null,3,"ü",null,null,3,"ü"]
[null,4,"ü",null,null,4,"ü"]
[null,5,null,null,null,5]
["F",1,"ü",null,"R",1,"ü"]
[null,2,"ü",null,null,2,"ü"]
[null,3,"ü",null,null,3,"ü"]
[null,4,"ü",null,null,4,"ü"]
[null,5,null,null,null,5]
["H",1,"ü",null,"S",1,"ü"]
[null,2,"ü",null,null,2,"ü"]
[null,3,"ü",null,null,3,"ü"]
[null,4,"ü",null,null,4,"ü"]
[null,5,null,null,null,5]
["J",1,"ü",null,"T",1,"ü"]
[null,2,"ü",null,null,2,"ü"]
[null,3,"ü",null,null,3,"ü"]
[null,4,"ü",null,null,4,"ü"]
[null,5,null,null,null,5]